program: Gaussian 09
title: 000192236
version: EM64L-G09RevD.01
frameworkgroup: C1[X(C14H23NO11)]
method: RPBEPBE
basis: SDD
operation: Freq
keyword: #p
keyword: freq=noraman
keyword: PBEPBE/SDD
title: #p freq=noraman PBEPBE/SDD
converged: YES YES NO NO
title: Mulliken charges:
elementType: O O O O O O O O O O O N C C C C C C C C C C C C C C H H H H H H H H H H H H H H H H H H H H H H H
charge: -0.304600 -0.433961 -0.451861 -0.434092 -0.458904 -0.248084 -0.440871 -0.187600 -0.318787 -0.256566 -0.455360 -0.382997 -0.129441 -0.049145 -0.214307 -0.499871 -0.136416 0.211731 -0.145041 0.154928 -0.379557 0.300278 -0.771480 0.255259 -0.135412 -0.664181 0.343559 0.261229 0.243007 0.271669 0.224725 0.228373 0.274477 0.322552 0.349005 0.240061 0.252636 0.381343 0.380964 0.375482 0.216764 0.259553 0.263049 0.403496 0.233378 0.230567 0.229563 0.233984 0.356901
chargesum: 0.00000
title: Mulliken charges with hydrogens summed into heavy atoms:
elementType: O O O O O O O O O O O N C C C C C C C C C C C C C C
charge: -0.304600 -0.084956 -0.070519 -0.053128 -0.083421 -0.248084 -0.037375 -0.187600 -0.318787 -0.256566 -0.098458 -0.060445 0.214118 0.212084 0.028700 -0.003477 0.091957 0.211731 0.129437 0.154928 0.113140 0.300278 -0.032114 0.255259 0.097967 0.029933
polarizability: 2.16927501e+02 1.11255583e+01 2.07989174e+02 -4.82142919e+00 1.82308131e+00 1.60352219e+02
1716.lowfreq: -10.3385 -7.0993 0.0002 0.0003 0.0007 2.2366 11.8062 25.6751 32.8938
frequency: 11.5960 25.5743 32.8335 37.9042 51.4369 51.7968 65.1002 72.7413 78.1857 84.3706 89.0401 106.3379 110.4027 142.5137 147.4307 173.9961 187.1304 190.7466 194.2769 218.8493 236.7729 240.0820 261.1854 266.1560 293.0303 295.0082 301.1684 309.9952 342.9683 350.3267 353.7938 380.1095 386.3155 390.0995 419.1116 423.8891 433.0356 449.3770 464.3710 472.9306 525.9214 533.6258 552.0348 557.4088 567.5413 572.4006 592.0226 608.5142 619.8839 625.8823 647.8211 675.2291 701.4415 729.9043 793.9826 797.2056 804.0327 824.1117 857.9240 879.9737 894.4318 917.7191 934.1357 942.9938 946.2345 970.7126 994.9377 996.2752 1009.9486 1017.3996 1044.7583 1048.8185 1056.5918 1064.2615 1073.3149 1074.3390 1085.4900 1092.1027 1096.3388 1107.4183 1123.6119 1125.9663 1164.5875 1192.5049 1214.2459 1222.6799 1242.1188 1246.5125 1255.5667 1273.5350 1285.7238 1286.7384 1290.9994 1303.8827 1305.9074 1321.8968 1327.8547 1338.6731 1340.3743 1345.8828 1355.8855 1373.7660 1378.1426 1383.4975 1392.2257 1398.6568 1404.8177 1431.7581 1448.7231 1450.1379 1452.8576 1462.4972 1467.9016 1471.2389 1501.0065 1604.5383 1624.7956 1689.0532 2951.2895 2952.9828 2998.9556 3001.5595 3007.1726 3025.8570 3029.8579 3035.1162 3037.8294 3043.4440 3098.4846 3101.1927 3106.3863 3107.7231 3107.8011 3123.8528 3185.3630 3480.1843 3495.6827 3531.9151 3534.5119 3539.4419 3564.3422
redmass: 6.5813 5.5003 4.3404 6.0329 4.9208 6.7971 3.0695 2.1170 6.2079 4.8772 2.4053 6.4975 5.5851 5.2546 4.8501 5.4486 4.1627 2.2150 2.1132 3.1516 6.6373 4.3728 4.2296 3.6753 2.0991 2.0037 2.9179 1.7768 5.0943 3.6853 2.4658 3.6277 2.6699 5.2138 3.3958 4.0368 3.0990 2.8612 1.5548 4.3489 2.2877 3.2540 2.2574 1.7346 1.7791 3.0684 1.9593 2.3118 3.6753 4.4778 3.6250 4.2071 4.2792 6.9705 3.2528 2.7681 1.3271 3.6027 3.4733 3.0956 4.7881 3.3029 3.8408 4.2552 3.1989 4.1644 4.7317 1.6774 4.2354 2.0425 1.6670 2.3476 3.7115 2.5089 2.5702 2.5839 1.9033 2.2820 2.4471 3.6281 3.6286 2.7873 2.5334 1.3076 1.2496 1.2416 1.5106 1.2311 1.2694 1.5737 1.2807 1.4688 1.3523 1.4799 1.2667 1.2215 1.5664 1.3313 1.1994 1.3281 1.2449 1.9409 1.2866 1.2668 1.2277 1.5516 1.5982 1.3741 1.0497 1.0957 1.1024 1.0525 1.1060 1.0712 2.0116 4.6537 9.2992 10.5020 1.0838 1.0824 1.0342 1.0362 1.0840 1.0617 1.0858 1.0851 1.0847 1.0575 1.1022 1.0985 1.1005 1.1013 1.1006 1.1089 1.0680 1.0650 1.0648 1.0650 1.0648 1.0775 1.0663
irintensity: 0.1958 0.4238 1.2965 0.8327 3.0657 4.9634 0.2765 0.1791 2.6268 6.6350 0.5374 7.9555 0.5055 2.8433 4.1426 6.7838 0.3258 1.3251 1.6742 3.2493 9.8115 3.7355 10.2630 2.7741 48.4666 64.5291 29.9415 88.8645 16.5897 19.2355 70.9231 13.6025 8.9149 15.6706 9.2124 6.9836 2.2263 46.2580 126.6863 15.8258 80.4257 1.2194 37.3829 71.4129 65.5235 65.0048 53.9924 42.4005 138.2882 8.0189 15.2889 25.6707 17.5247 31.6626 12.3387 60.6924 143.9157 9.5625 122.3496 8.4128 62.8364 9.4561 87.2907 74.2700 29.9959 141.2732 32.2396 7.6949 82.3702 56.3213 9.6100 20.0193 52.8595 73.6036 88.8228 59.1341 130.2535 80.8252 49.0680 35.8261 24.7959 3.1325 154.3217 0.8656 40.6118 30.4626 93.1723 18.6158 34.5409 80.7150 1.3656 3.6409 12.5054 34.5815 1.5280 1.5400 18.0662 1.0215 40.6446 6.5305 21.9825 40.3281 23.2800 32.2696 62.2959 12.0557 9.5100 111.8943 13.8880 13.4621 10.3133 18.8678 29.1318 21.9338 230.3108 181.6911 138.6930 206.8977 28.8850 18.7318 11.4414 8.2511 14.4121 12.3696 6.8601 18.0797 10.9933 26.8291 8.1031 7.4847 25.0330 25.9461 14.3231 10.9427 454.9324 19.9744 80.2578 12.8723 66.4733 25.3823 6.8402
temp: 298.150 k
press: 1.00000 atm
elementType: 8 8 8 8 8 8 8 8 8 8 8 7 6 6 6 6 6 6 6 6 6 6 6 6 6 6 1 1 1 1 1 1 1 1 1 1 1 1 1 1 1 1 1 1 1 1 1 1 1
symmnumber: 1
zpe: 1002104.5 jmol-1
zpe.correction: 0.381681 hartree
zpe.thermalcorrener: 0.410246 hartree
zpe.thermalcorrenthalpy: 0.411190 hartree
zpe.thermalcorrgfe: 0.320468 hartree
zpe.sumelectzpe: -1427.445329 hartree
zpe.sumelectthermal: -1427.416765 hartree
zpe.sumelectthermalent: -1427.415821 hartree
zpe.sumelectthermalfe: -1427.506543 hartree
dipole: -8.5634 3.3944 4.3790
dipole: 10.1995
quadrupole: -164.9032 -131.7969 -159.7989
quadrupole: 7.1911 4.2336 6.8693
quadrupole: -12.7369 20.3694 -7.6325 7.1911 4.2336 6.8693
hfenergy: -1427.8270109 hartree
pointgroup: C01 [X(C14H23N1O11)]
dipole: -3.3398222 -1.0854494 -1.9415866 debye
polarizability: 216.7205868|-11.8328385|206.7589126|4.2820206|7.7780023|161.7893948 unknown
InChI: InChI=1S/C14H23NO11/c1-5(16)12(21)25-4-8(19)10(20)11-9(15-6(2)17)7(18)3-14(24,26-11)13(22)23/h5,7-11,15-16,18-20,22,24H,3-4H2,1-2H3
charge 0 multiplicity 1
49 atoms
O  -1.620748 0.961428 0.113791
O  -3.240837 -2.947847 0.340611
O  1.090556 -0.258666 0.768762
O  -3.652219 1.018102 -1.199205
O  0.031183 2.406819 -1.522982
O  3.355274 0.855269 -1.014985
O  -3.275706 3.245719 0.344989
O  -3.974642 1.982011 2.178359
O  1.177041 -2.862975 0.139644
O  3.836966 2.216735 0.81886
O  5.995478 0.672355 1.501771
N  -0.829994 -2.597882 -1.014457
C  -1.378508 -1.510496 -0.177169
C  -0.936691 -0.104432 -0.682855
C  -2.91704 -1.612548 -0.1848
C  -3.541572 -0.492988 0.666622
C  0.58711 0.136685 -0.538225
C  -3.082964 0.866082 0.131958
C  0.981866 1.633143 -0.708257
C  -3.497547 2.046649 1.034213
C  2.310452 1.817906 -1.461453
C  0.351578 -3.256784 -0.752481
C  0.635441 -4.495448 -1.587784
C  4.027894 1.169967 0.152956
C  5.05474 0.099424 0.538977
C  4.369745 -1.163431 1.108057
H  -1.01429 -1.641568 0.858601
H  -1.230819 0.023021 -1.743677
H  -3.287726 -1.513396 -1.229087
H  -3.225142 -0.592534 1.718523
H  -4.644573 -0.543029 0.625364
H  1.064991 -0.469386 -1.339179
H  1.05341 2.048174 0.314683
H  -1.480849 -3.040728 -1.666554
H  -4.22373 -3.034338 0.429711
H  2.169237 1.589451 -2.52959
H  2.681059 2.847941 -1.330141
H  1.234657 -1.259123 0.738091
H  -3.479685 1.944947 -1.51373
H  -0.793878 2.484765 -0.972657
H  -0.126241 -4.68888 -2.361875
H  1.621397 -4.390455 -2.070674
H  0.691472 -5.370294 -0.917118
H  -3.510721 4.029198 0.910339
H  5.640703 -0.167073 -0.358824
H  3.749667 -1.664699 0.345204
H  3.726781 -0.90553 1.966772
H  5.156568 -1.857354 1.448797
H  5.532063 1.428095 1.956605
