program: Gaussian 09
title: 000192191
version: EM64L-G09RevD.01
frameworkgroup: C1[X(C21H30NO4)]
method: RPBEPBE
basis: SDD
operation: Freq
keyword: #p
keyword: freq=noraman
keyword: PBEPBE/SDD
title: #p freq=noraman PBEPBE/SDD
converged: NO YES NO NO
title: Mulliken charges:
elementType: O O O O N C C C C C C C C C C C C C C C C C C C C C H H H H H H H H H H H H H H H H H H H H H H H H H H H H H H
charge: -0.273473 -0.275046 -0.243941 -0.434642 -0.155381 -0.105492 -0.097269 -0.132873 -0.128587 -0.562767 -0.560354 -0.029157 -0.317254 -0.616412 -0.373081 -0.355988 0.242105 -0.680086 -0.374214 -0.363578 0.500981 -0.441084 -0.405748 -0.220326 -0.230023 -0.241355 0.300763 0.301631 0.299444 0.299865 0.285700 0.282608 0.304587 0.280666 0.285969 0.234892 0.314202 0.299418 0.266771 0.271120 0.228318 0.199798 0.216344 0.205055 0.213828 0.219461 0.243986 0.271233 0.218277 0.250939 0.244458 0.245569 0.363007 0.242651 0.239258 0.245228
chargesum: 1.00000
title: Mulliken charges with hydrogens summed into heavy atoms:
elementType: O O O O N C C C C C C C C C C C C C C C C C C C C C
charge: -0.273473 -0.275046 -0.243941 -0.071635 -0.155381 0.195272 0.204362 0.166571 0.171278 0.005541 0.024900 0.256812 0.231840 0.220898 0.055035 0.065410 0.242105 -0.002811 -0.102981 0.105637 0.500981 -0.196626 -0.160180 0.022326 0.009236 0.003873
polarizability: 2.42543451e+02 3.48409813e+00 2.46694205e+02 -9.35284037e+00 2.60732665e+00 2.03468859e+02
1716.lowfreq: -1.5511 -0.0010 -0.0009 -0.0007 4.4047 8.9711 14.2883 17.5673 33.8616
frequency: 13.8091 16.3599 33.7593 37.5323 47.2287 49.8641 71.2471 79.0373 87.6495 105.9533 114.5417 125.3627 156.0132 175.4244 195.3801 207.0152 226.0285 227.7104 246.5832 258.2441 274.8131 305.9839 315.3968 324.7190 330.2790 363.6085 376.8082 396.4642 403.7592 425.0809 428.4703 439.4037 453.3669 486.1517 517.1661 527.6986 535.9259 556.4979 610.0087 613.3255 649.6458 660.9341 703.4845 705.7396 718.0379 739.4848 744.3735 771.3145 774.6023 789.2715 809.9644 816.9850 833.8712 849.0411 859.2559 864.0911 870.6591 881.8471 906.2052 924.2283 930.1111 938.2603 964.1671 969.6719 976.6279 982.6056 989.6111 991.0343 993.6285 1001.3939 1005.3548 1014.1935 1027.1057 1031.4157 1037.5224 1044.0031 1065.8119 1068.6378 1070.2775 1083.8834 1104.9864 1109.8412 1132.0064 1137.0996 1146.3469 1174.2686 1177.5334 1178.9364 1181.2259 1190.7824 1191.7302 1198.7470 1216.2991 1231.7588 1240.2497 1245.5642 1262.3984 1266.1533 1275.4849 1291.2953 1297.4683 1300.1031 1306.4803 1315.3311 1320.1426 1325.8874 1334.8773 1341.2977 1342.8181 1345.8137 1358.4648 1369.0598 1371.2865 1382.8216 1385.0010 1399.9702 1434.9261 1442.4970 1457.1966 1461.8496 1466.6673 1470.9453 1476.3232 1477.0546 1480.3259 1481.1231 1488.7706 1494.4836 1516.5948 1592.0628 1607.7557 1629.2254 2975.9096 2983.7590 2985.8256 2997.2204 3023.0970 3024.8988 3029.0874 3031.5872 3035.2462 3036.4467 3039.1633 3054.0453 3077.5053 3078.3514 3081.6809 3087.5826 3093.1521 3097.9425 3105.6441 3114.7777 3127.1045 3140.3298 3140.5744 3151.7214 3151.9854 3160.5939 3170.1657 3176.1030 3177.5044 3562.6254
redmass: 4.7971 4.4327 5.0284 3.7497 4.9605 2.5876 2.2116 4.1924 4.8737 4.4362 3.7782 2.8393 4.7722 4.6902 2.0276 1.7805 1.9562 1.4722 2.7293 3.7086 4.4702 5.5398 5.4194 3.5175 5.2323 3.0314 3.8565 2.4542 2.8271 1.3973 1.6780 3.1442 3.1717 2.8816 3.0875 4.0406 4.6750 5.4100 3.9401 6.3153 5.2303 4.3527 4.1869 2.5164 2.6552 2.0825 1.2930 4.5475 2.0431 1.2597 3.6350 3.1963 3.1238 3.4675 1.2489 3.3971 3.2512 1.8567 1.7713 1.5210 1.4464 3.3254 1.7875 2.0240 2.4590 1.3940 4.6110 2.3813 2.2221 2.5371 1.3373 2.6261 2.3013 3.2096 3.2809 2.6210 2.6153 1.3269 1.9135 1.6252 2.6359 2.2898 1.4734 1.7817 2.0138 1.3672 1.0783 1.5318 1.6083 1.1192 1.4123 2.0824 1.2052 1.6088 1.3451 1.3854 1.4147 1.2826 1.3898 1.5187 1.1475 1.4805 1.2723 1.4361 1.2715 1.3642 1.2925 1.3417 1.2523 1.3853 1.8607 1.4698 1.2529 6.5601 1.5927 1.2039 1.1423 2.1523 1.0759 1.0824 1.0705 1.0649 1.0539 1.0631 1.0429 2.2428 1.0930 1.0712 1.0551 6.0899 6.1197 9.8990 1.0592 1.0584 1.0388 1.0654 1.0944 1.0618 1.0649 1.0723 1.0826 1.0806 1.0421 1.1000 1.0952 1.0958 1.1013 1.1002 1.0992 1.1011 1.0889 1.0888 1.0881 1.1035 1.0904 1.0978 1.0954 1.0895 1.1013 1.0997 1.1022 1.0660
irintensity: 0.2548 0.4171 1.5454 0.1010 1.2989 1.4913 1.6231 1.3073 0.7721 2.0297 1.2140 1.3888 6.6418 4.7251 0.2021 0.5581 2.1507 1.6044 2.6367 1.9050 2.7070 4.9403 1.8790 4.2699 7.0574 13.4437 29.1858 8.5528 0.5298 139.9409 78.9978 1.9817 2.0098 1.5566 14.0593 30.1110 9.4626 7.9271 3.0608 0.3956 4.6896 1.8664 3.3686 25.2131 41.2808 6.8494 9.5863 4.4553 37.1623 11.4470 15.6460 43.7106 59.1244 26.2095 0.1194 16.1584 2.5903 1.1295 1.8971 0.9709 5.8055 22.0244 16.0406 31.4921 135.6749 0.6399 1.9943 17.9673 5.7663 37.5506 0.3612 21.7188 8.1224 41.3791 64.7191 29.2875 11.0617 4.2878 15.1007 15.1199 240.5754 54.6518 8.9654 4.8514 1.0348 31.6484 3.3687 6.6861 0.4065 0.4395 8.3983 21.8694 0.1507 34.9510 1.4750 5.2218 3.2863 0.9394 6.0647 7.3213 3.7277 2.1299 14.9856 39.4831 2.2694 4.6171 6.6318 5.5686 16.3676 1.6751 0.8408 7.9871 11.2191 2.1855 4.9053 9.2184 11.0036 9.4742 12.8749 9.0987 33.7207 0.5968 4.4905 5.3869 17.0762 18.4880 23.1342 40.1279 2.3427 6.5484 17.1271 124.2505 5.4035 28.7654 34.0830 28.1705 2.3554 2.9746 2.6345 8.4879 10.4728 5.9633 3.5957 22.0434 3.1897 5.2580 54.0497 7.6799 28.1051 8.6992 2.2405 7.1644 4.6294 1.9038 3.2179 2.0802 21.6806 0.2097 14.2008 1.0005 1.2523 17.4787
temp: 298.150 k
press: 1.00000 atm
elementType: 8 8 8 8 7 6 6 6 6 6 6 6 6 6 6 6 6 6 6 6 6 6 6 6 6 6 1 1 1 1 1 1 1 1 1 1 1 1 1 1 1 1 1 1 1 1 1 1 1 1 1 1 1 1 1 1
symmnumber: 1
zpe: 1253429.1 jmol-1
zpe.correction: 0.477406 hartree
zpe.thermalcorrener: 0.503015 hartree
zpe.thermalcorrenthalpy: 0.503959 hartree
zpe.thermalcorrgfe: 0.419269 hartree
zpe.sumelectzpe: -1171.591942 hartree
zpe.sumelectthermal: -1171.566333 hartree
zpe.sumelectthermalent: -1171.565389 hartree
zpe.sumelectthermalfe: -1171.650078 hartree
dipole: 9.6564 1.9396 2.4322
dipole: 10.1452
quadrupole: -119.9337 -134.4218 -136.7753
quadrupole: -7.3159 5.2810 -1.5715
quadrupole: 10.4432 -4.0449 -6.3984 -7.3159 5.2810 -1.5715
hfenergy: -1172.0693476 hartree
pointgroup: C01 [X(C21H30N1O4)]
dipole: -3.7292474 -1.2272564 0.7197286 debye
polarizability: 239.6678557|3.8300926|247.1822579|12.6075168|-4.1177998|205.8564012 unknown
InChI: InChI=1S/C21H30NO4/c1-3-4-10-22(2)17-11-15(12-18(22)20-19(17)26-20)25-21(24)16(13-23)14-8-6-5-7-9-14/h5-9,15-20,23H,3-4,10-13H2,1-2H3
charge 1 multiplicity 1
56 atoms
O  -4.307378 1.684996 -0.821028
O  1.010125 1.339744 0.860453
O  1.947533 2.172787 -1.09937
O  4.41242 3.445378 -0.033821
N  -2.758101 -0.109376 0.586891
C  -2.729726 1.331608 1.20778
C  -2.191211 0.194728 -0.844382
C  -3.19886 2.226041 0.049924
C  -2.866279 1.517727 -1.224236
C  -1.268617 1.714838 1.531238
C  -0.675456 0.482672 -0.741929
C  -0.335482 1.611102 0.289843
C  -4.220919 -0.696583 0.608674
C  -1.907809 -1.108722 1.366804
C  -4.502053 -1.785685 -0.437388
C  -5.882397 -2.437234 -0.151053
C  2.108578 1.659002 0.032049
C  -6.257106 -3.490724 -1.214288
C  3.423399 1.273047 0.690595
C  4.600758 1.997631 -0.025769
C  3.597827 -0.250465 0.686206
C  3.903265 -0.938954 1.885794
C  3.508641 -0.98213 -0.527637
C  4.117909 -2.335958 1.875499
C  3.717604 -2.379192 -0.536889
C  4.023544 -3.0603 0.664682
H  -3.380211 1.335508 2.097508
H  -2.41646 -0.656669 -1.502363
H  -3.185226 3.311113 0.180907
H  -2.571594 2.012742 -2.153402
H  -0.868984 1.091658 2.348254
H  -1.256415 2.751777 1.911397
H  -0.312172 0.795385 -1.736897
H  -0.112849 -0.433505 -0.492759
H  -0.285298 2.576467 -0.244352
H  -4.339066 -1.098173 1.631441
H  -4.908463 0.144571 0.462175
H  -0.845991 -0.842216 1.36538
H  -2.274224 -1.133952 2.40459
H  -2.036685 -2.100475 0.908512
H  -4.528163 -1.346471 -1.452263
H  -3.728871 -2.579793 -0.431463
H  -6.660798 -1.649651 -0.120969
H  -5.867737 -2.909726 0.851427
H  -5.514503 -4.309075 -1.251579
H  -6.319117 -3.040099 -2.221704
H  -7.239207 -3.940893 -0.989287
H  3.380863 1.629126 1.736314
H  4.72848 1.594284 -1.049579
H  5.525523 1.815304 0.544438
H  3.985038 -0.380789 2.826232
H  3.289946 -0.460982 -1.468723
H  3.802453 3.68158 -0.778501
H  4.367018 -2.855446 2.807023
H  3.660494 -2.933795 -1.480047
H  4.19911 -4.14128 0.655446
