program: Gaussian 09
title: 000192179
version: EM64L-G09RevD.01
frameworkgroup: C1[X(C12H19Cl2N5)]
method: RPBEPBE
basis: SDD
operation: Freq
keyword: #p
keyword: freq=noraman
keyword: PBEPBE/SDD
title: #p freq=noraman PBEPBE/SDD
converged: NO YES NO NO
title: Mulliken charges:
elementType: Cl Cl N N N N N C C C C C C C C C C C C H H H H H H H H H H H H H H H H H H H
charge: 0.025230 0.020807 -0.396371 -0.326212 0.003009 0.002589 0.109368 0.304191 0.306533 -0.121660 -0.437189 -0.432462 -0.743959 -0.715427 -0.716439 -0.744506 0.111287 -0.264100 -0.246657 0.280150 0.213034 0.194979 0.195120 0.213234 0.245378 0.206900 0.234697 0.210932 0.215557 0.207542 0.220899 0.216322 0.207263 0.220637 0.206625 0.234697 0.211215 0.326785
chargesum: 0.00000
title: Mulliken charges with hydrogens summed into heavy atoms:
elementType: Cl Cl N N N N N C C C C C C C C C C C C
charge: 0.025230 0.020807 -0.150993 0.000573 0.003009 0.002589 0.109368 0.304191 0.306533 0.158491 -0.029176 -0.024108 -0.091429 -0.071429 -0.072216 -0.091969 0.111287 -0.264100 -0.246657
polarizability: 2.48296652e+02 -1.67316106e+00 1.87984197e+02 5.11245346e-01 -1.65414960e+00 1.38382286e+02
1716.lowfreq: -20.2828 -13.8369 -5.4762 -2.7135 -0.0021 -0.0021 -0.0014 26.3862 37.6850
frequency: -16.4609 24.9231 37.4484 110.0879 116.7304 133.5763 145.5547 150.9614 153.1583 163.5665 164.2820 213.4882 223.2048 234.7538 238.2002 269.0069 289.1926 298.2844 320.1698 331.8693 336.0481 379.6238 404.8666 422.7072 425.8951 443.2499 453.3154 459.4490 485.2094 532.9221 553.9396 586.9276 616.8481 635.5704 646.0411 678.5828 774.2004 777.6486 785.8516 793.5925 866.4209 869.1549 880.9649 887.0201 905.7283 910.8695 924.1414 944.3788 956.5301 984.4810 987.8754 1015.6137 1040.8255 1083.2906 1086.1908 1108.3451 1131.4584 1165.3399 1184.0029 1185.4339 1202.8105 1205.2270 1245.5164 1269.3267 1283.2581 1291.8123 1295.2650 1303.9275 1339.7617 1344.0258 1367.3997 1369.4871 1378.8216 1384.1613 1393.1074 1434.7372 1444.0491 1449.4631 1453.5691 1455.3048 1459.3830 1464.8071 1468.0464 1478.2417 1480.4156 1487.8341 1491.4038 1493.5333 1583.1349 2972.8304 2973.3868 2973.7292 2976.6751 2978.9911 2981.9010 3043.8967 3046.5697 3062.8693 3063.5726 3069.2993 3070.0112 3071.7055 3083.9397 3091.0658 3091.7989 3097.5848 3447.3841 3527.1488
redmass: 4.6264 6.3973 5.0682 2.5445 3.5507 10.2270 2.5957 2.2812 1.8038 9.5308 10.4018 1.0775 3.4056 1.7264 1.2706 1.9479 1.5895 2.5663 3.2613 4.1257 2.4546 11.2367 3.6143 2.5722 5.0456 1.6934 2.7628 2.5395 2.4601 3.2631 2.5922 4.5756 9.7267 1.7677 5.2885 3.0351 3.0520 3.5968 10.6690 7.6777 1.7401 5.6374 2.7175 2.4754 1.4925 1.6522 1.8778 3.0968 2.2049 1.4107 1.3123 1.8618 1.6766 3.5784 1.4243 3.1753 4.5969 2.1180 10.8984 2.8841 2.9470 3.3727 2.2379 2.3633 2.5428 2.0575 1.3701 2.0383 1.3446 2.0249 1.2117 1.4327 1.4359 1.2228 1.2087 1.1880 1.1037 2.3276 1.1934 1.0623 1.0646 1.0630 1.0769 1.0577 1.1182 1.1539 2.9107 1.0826 6.6811 1.0367 1.0362 1.0539 1.0497 1.0448 1.0477 1.0944 1.1002 1.0989 1.0983 1.0977 1.0925 1.0980 1.0994 1.0999 1.0999 1.0963 1.0742 1.0763
irintensity: 0.4736 0.0322 0.6048 0.0986 0.5422 0.2899 0.1653 0.1639 0.0550 0.6065 0.6058 0.1119 0.7702 0.5880 0.2184 0.3563 2.4772 0.0901 0.5652 2.6104 3.6317 9.4733 7.3707 0.5977 3.8544 67.6148 1.0340 5.9784 1.7773 14.5659 53.2190 27.4621 2.7578 46.8426 11.2531 38.3927 1.1108 28.6144 14.5761 140.0064 0.4662 1.6285 1.9278 8.1312 2.6911 5.0779 0.4263 2.7136 25.3059 1.9336 1.1295 1.0749 0.1589 50.5883 10.7206 2.1473 135.9697 17.0584 192.2624 21.5541 30.7364 10.2286 71.4043 46.0557 21.1799 80.1751 7.0234 113.7563 0.9008 226.5623 0.3624 143.6610 25.5645 36.9827 4.4885 16.4987 1.5292 215.9289 59.9172 7.0064 3.0109 18.9504 15.1995 9.1077 32.5622 8.8394 506.6949 7.5664 886.4387 13.2047 37.9264 0.8746 70.1698 46.9537 4.0805 14.0377 16.1554 3.8366 4.1265 57.3766 29.0994 73.9293 17.9950 46.2478 44.5280 36.6354 3.1837 66.7215
temp: 298.150 k
press: 1.00000 atm
elementType: 17 17 7 7 7 7 7 6 6 6 6 6 6 6 6 6 6 6 6 1 1 1 1 1 1 1 1 1 1 1 1 1 1 1 1 1 1 1
symmnumber: 1
zpe: 800727.6 jmol-1
zpe.correction: 0.304981 hartree
zpe.thermalcorrener: 0.324060 hartree
zpe.thermalcorrenthalpy: 0.325004 hartree
zpe.thermalcorrgfe: 0.257956 hartree
zpe.sumelectzpe: -1661.091608 hartree
zpe.sumelectthermal: -1661.072529 hartree
zpe.sumelectthermalent: -1661.071585 hartree
zpe.sumelectthermalfe: -1661.138634 hartree
dipole: -6.2022 -1.0435 0.0205
dipole: 6.2894
quadrupole: -141.5531 -133.1888 -124.9802
quadrupole: -3.5133 0.3606 0.6438
quadrupole: -8.3124 0.0519 8.2605 -3.5133 0.3606 0.6438
hfenergy: -1661.3965894 hartree
pointgroup: C01 [X(C12H19Cl2N5)]
dipole: 2.416932 -0.0649685 -0.5263447 debye
polarizability: 246.844741|10.2811955|159.7345686|-7.5261499|23.7298765|168.0838249 unknown
InChI: InChI=1S/C12H19Cl2N5/c1-11(2)5-7(6-12(3,4)19-11)15-10-17-8(13)16-9(14)18-10/h7,15,19H,5-6H2,1-4H3
charge 0 multiplicity 1
38 atoms
Cl -5.478277 -1.673631 -0.792142
Cl -3.238622 1.594301 2.841081
N  3.605242 0.098173 -0.410852
N  -0.525266 -0.833713 -0.663725
N  -1.819193 0.296989 0.966674
N  -2.838179 -1.192255 -0.684058
N  -4.217208 -0.066792 0.962415
C  3.13038 -0.873534 0.613227
C  2.755867 1.210729 -0.921606
C  0.768499 -0.269645 -0.217165
C  1.743994 -1.409139 0.154786
C  1.38069 0.611054 -1.331186
C  4.145566 -2.045214 0.61555
C  3.041976 -0.307708 2.068543
C  2.55787 2.399792 0.074622
C  3.462747 1.759018 -2.187742
C  -1.734699 -0.565702 -0.114034
C  -4.005039 -0.892616 -0.100831
C  -3.064933 0.481292 1.428157
H  0.535451 0.34274 0.669238
H  1.30582 -2.033583 0.955407
H  1.897366 -2.052205 -0.735751
H  1.527699 -0.011986 -2.236729
H  0.682107 1.428441 -1.589697
H  4.575571 0.395036 -0.24441
H  5.140585 -1.703204 0.960671
H  4.257625 -2.454053 -0.403542
H  3.815683 -2.853413 1.293302
H  2.83741 -1.122093 2.788881
H  4.001422 0.162983 2.353744
H  2.24747 0.44791 2.185944
H  2.078349 3.256501 -0.435005
H  3.536744 2.740062 0.461249
H  1.927688 2.132849 0.939578
H  4.436706 2.217167 -1.927231
H  3.648843 0.940761 -2.904692
H  2.848595 2.535333 -2.679151
H  -0.535249 -1.47664 -1.46092
