program: Gaussian 09
title: 000192172
version: EM64L-G09RevD.01
frameworkgroup: C1[X(C11H15N)]
method: RPBEPBE
basis: SDD
operation: Freq
keyword: #pfreq=noraman
keyword: PBEPBE/SDD
title: #p freq=noraman PBEPBE/SDD
converged: NO YES NO NO
title: Mulliken charges:
elementType: N C C C C C C C C C C C H H H H H H H H H H H H H H H
charge: -0.317701 0.207940 -0.481039 0.327444 0.245521 -0.545666 -0.731021 -0.738899 -0.386294 -0.375537 -0.268014 -0.252950 0.210993 0.189968 0.198836 0.232126 0.216968 0.200533 0.254733 0.222830 0.208418 0.211951 0.268626 0.225964 0.226153 0.223365 0.224753
chargesum: 0.00000
title: Mulliken charges with hydrogens summed into heavy atoms:
elementType: N C C C C C C C C C C C
charge: -0.049075 0.207940 -0.080078 0.327444 0.245521 -0.114705 -0.058787 -0.095700 -0.160330 -0.149385 -0.044649 -0.028197
polarizability: 1.46476987e+02 -5.03848665e-01 1.30290308e+02 -7.96826523e-01 -1.20513077e+00 7.88734361e+01
1716.lowfreq: -10.5248 -6.2770 0.0003 0.0005 0.0007 8.7067 73.8982 110.1080 194.6368
frequency: 73.7582 110.0800 194.6296 225.2784 244.8799 251.6751 275.5093 302.0636 333.8263 368.3807 404.9467 419.6627 458.2171 508.2584 531.2685 546.4790 565.9844 667.7092 727.9253 744.3109 766.8197 798.6597 861.3003 868.6814 901.6883 933.1554 943.7142 971.2584 983.8574 988.1189 1005.5353 1019.5394 1040.4765 1080.2797 1130.3913 1146.2858 1162.4488 1174.5516 1194.4516 1210.7358 1229.4559 1249.0471 1261.4419 1296.4353 1306.1912 1365.2274 1372.2518 1381.8360 1393.4841 1434.6502 1444.3839 1458.0497 1462.2911 1464.4628 1474.0858 1481.2690 1483.8081 1492.1240 1586.1826 1614.7369 2820.2950 2848.2331 2968.7842 2973.4607 3013.1913 3032.8580 3060.7039 3066.2913 3079.5955 3092.6506 3106.2274 3121.3003 3137.2981 3157.5203 3472.9997
redmass: 3.0339 2.9004 1.8833 1.3460 2.7632 1.0443 2.4962 2.7462 2.4366 2.3671 3.3451 3.0544 3.0398 3.1773 2.6737 2.9842 2.4747 4.4560 2.2477 2.9695 1.6074 3.4159 2.7234 1.3696 2.1096 1.4520 1.4013 1.7080 1.3349 1.9104 1.6857 1.5448 2.4792 2.3798 1.8986 2.1413 2.6641 1.0739 1.4024 1.9635 2.7441 1.6385 1.5184 1.7298 1.4042 1.3074 1.7081 3.0050 1.2499 2.0648 1.3796 1.0666 1.1522 1.0680 1.1018 1.2622 1.1614 1.4645 6.9332 6.2978 1.0713 1.0705 1.0358 1.0360 1.0861 1.0893 1.0989 1.0980 1.0997 1.0997 1.0875 1.0864 1.0930 1.1005 1.0755
irintensity: 0.1998 0.3334 2.9414 1.6349 1.2143 0.0632 0.4328 2.8229 1.9056 3.0907 1.1248 19.6720 2.7582 6.7716 24.6738 12.7423 47.9240 9.1676 66.0242 3.5077 50.2340 2.3814 2.6530 0.2746 5.3681 1.5637 0.9685 1.8342 0.3483 6.8781 2.6371 2.4641 11.8016 9.6083 7.1433 4.9719 7.8448 0.3974 0.6058 0.7671 2.3043 21.4078 2.0173 8.7768 8.5401 15.2911 9.6762 4.6162 15.1149 13.9182 0.6732 0.4653 8.3483 0.0153 8.7395 10.3467 3.2241 33.0151 2.2328 1.8058 94.2629 123.9390 30.8847 41.8668 31.2372 32.9028 5.3142 88.8306 29.9822 15.3505 14.3992 2.6649 36.7246 33.1307 0.7059
temp: 298.150 k
press: 1.00000 atm
elementType: 7 6 6 6 6 6 6 6 6 6 6 6 1 1 1 1 1 1 1 1 1 1 1 1 1 1 1
symmnumber: 1
zpe: 612126.8 jmol-1
zpe.correction: 0.233147 hartree
zpe.thermalcorrener: 0.244062 hartree
zpe.thermalcorrenthalpy: 0.245006 hartree
zpe.thermalcorrgfe: 0.197520 hartree
zpe.sumelectzpe: -482.014832 hartree
zpe.sumelectthermal: -482.003917 hartree
zpe.sumelectthermalent: -482.002972 hartree
zpe.sumelectthermalfe: -482.050458 hartree
dipole: 0.7913 0.8069 -0.8564
dipole: 1.4180
quadrupole: -66.9726 -64.8860 -78.0243
quadrupole: 1.3652 -1.6692 -1.3529
quadrupole: 2.9884 5.0749 -8.0633 1.3652 -1.6692 -1.3529
hfenergy: -482.2479785 hartree
pointgroup: C01 [X(C11H15N1)]
dipole: -0.3250375 0.3014543 0.3387075 debye
polarizability: 146.4080371|1.1900072|130.3411132|-0.7251867|1.5634266|78.8915809 unknown
InChI: InChI=1S/C11H15N/c1-11(2)8-12-7-9-5-3-4-6-10(9)11/h3-6,12H,7-8H2,1-2H3
charge 0 multiplicity 1
27 atoms
N  -1.711269 1.739535 -0.248002
C  -1.386353 -0.710847 0.029499
C  -2.176941 0.549195 0.48591
C  0.124954 -0.39179 0.031249
C  0.604987 0.948562 0.071667
C  -0.348864 2.137434 0.14252
C  -1.823788 -1.096013 -1.413894
C  -1.726441 -1.868605 1.006932
C  1.076495 -1.444439 -0.039067
C  2.000943 1.196378 0.065362
C  2.46344 -1.192102 -0.05083
C  2.933086 0.141047 0.005495
H  -3.25187 0.396262 0.27657
H  -2.060741 0.660834 1.595014
H  -0.302597 2.556682 1.182694
H  0.005371 2.933091 -0.539775
H  -1.20324 -1.92078 -1.809092
H  -2.881214 -1.42549 -1.421422
H  -1.719102 -0.223219 -2.080624
H  -1.350489 -1.660081 2.025477
H  -2.823871 -2.003529 1.062232
H  -1.295729 -2.828979 0.672982
H  -2.37849 2.519107 -0.23139
H  0.725974 -2.482236 -0.081151
H  2.357005 2.234593 0.099659
H  3.172374 -2.026147 -0.1045
H  4.008273 0.352237 -0.003813
