program: Gaussian 09
title: 000192171
version: EM64L-G09RevD.01
frameworkgroup: C1[X(C13H17NO2)]
method: RPBEPBE
basis: SDD
operation: Freq
keyword: #p
keyword: freq=noraman
keyword: PBEPBE/SDD
title: #p freq=noraman PBEPBE/SDD
converged: YES YES NO NO
title: Mulliken charges:
elementType: O O N C C C C C C C C C C C C C H H H H H H H H H H H H H H H H H
charge: -0.444073 -0.493274 -0.299325 -0.211811 -0.189681 -0.476772 -0.467936 0.421768 -0.370983 -0.527232 -0.419902 0.150485 -0.450848 -0.004170 -0.377448 0.121554 0.234628 0.229319 0.220459 0.218275 0.196705 0.218473 0.192501 0.205139 0.228703 0.245819 0.248523 0.181018 0.206467 0.238217 0.218830 0.385041 0.371531
chargesum: 0.00000
title: Mulliken charges with hydrogens summed into heavy atoms:
elementType: O O N C C C C C C C C C C C C C
charge: -0.059032 -0.121743 -0.050802 0.022816 0.039639 -0.038037 -0.052759 0.421768 0.026657 -0.052710 -0.032417 0.150485 -0.212631 -0.004170 -0.158618 0.121554
polarizability: 1.99347987e+02 2.68294774e+00 1.52832855e+02 -2.34062720e+00 3.97284664e+00 9.50267895e+01
1716.lowfreq: -19.1717 -7.2342 -0.0011 -0.0001 0.0006 5.8923 63.2773 74.8196 145.3095
frequency: 63.2745 74.7892 145.3001 151.4231 191.2100 211.1967 233.6522 244.8346 276.6537 285.1755 290.7027 316.5833 378.1693 393.4502 412.1471 460.7770 481.6592 491.9987 493.5752 509.9587 561.9742 577.4764 587.5728 617.1844 659.7443 675.9050 723.7084 768.1706 785.5577 799.9875 838.5696 861.9509 879.4388 892.1986 904.8643 911.3810 955.2120 988.1913 1007.7880 1031.4882 1047.2067 1075.3166 1100.7247 1114.4081 1127.6276 1148.6952 1151.8525 1166.4860 1178.9042 1201.7587 1211.2400 1221.2682 1225.7698 1252.2863 1257.8674 1266.9615 1285.1588 1305.6105 1309.5873 1325.5764 1334.8617 1340.7386 1343.7992 1352.5841 1381.3361 1402.8119 1449.5520 1454.2963 1456.3595 1464.1119 1478.4417 1482.0973 1483.7453 1488.3704 1598.0492 1630.2801 2860.2976 2962.6950 2963.4940 2976.9947 2980.6755 2984.7269 2986.0941 3024.4656 3031.6617 3034.6137 3046.3630 3052.1549 3115.7806 3139.7523 3447.5712 3519.2862 3626.1079
redmass: 4.6423 3.5988 3.4557 3.8889 2.9599 2.5225 1.1608 3.1825 4.4580 3.7938 5.1482 2.1230 3.2882 3.2145 3.0736 4.0760 2.4163 1.4084 2.1143 3.5069 3.4797 3.0357 2.9148 4.1155 2.7510 2.6426 3.8776 2.3849 1.7745 3.0483 1.7767 2.2230 2.9194 2.0429 1.4151 2.2886 2.2998 2.4296 1.8590 1.8875 2.3955 1.7853 1.8914 2.4000 1.4334 1.6554 1.7898 1.7999 1.4187 1.2950 1.7773 1.5037 2.0845 1.5055 1.2428 2.0335 1.6570 1.3208 1.2445 1.4111 1.6222 1.4164 1.4898 1.4728 1.5043 5.3524 1.1684 1.2088 1.2566 1.1029 1.4769 2.0137 2.3241 1.0932 7.8127 7.1232 1.0710 1.0823 1.0674 1.0723 1.0704 1.0630 1.0622 1.0885 1.0947 1.0979 1.1013 1.1029 1.0868 1.0966 1.0748 1.0647 1.0666
irintensity: 0.2536 1.9395 2.3600 1.4882 0.5214 14.8138 164.1168 6.9921 1.5004 0.1355 5.2042 1.9438 8.0438 5.3560 3.6008 13.6372 23.1206 74.5572 43.4848 0.3156 77.7611 34.9180 9.2389 1.4231 41.2806 8.8775 0.6049 16.1050 35.3423 1.1698 6.5507 0.7214 42.5248 23.7594 3.2085 52.6737 5.0232 17.3563 10.7718 21.3313 50.6619 4.5767 2.0309 17.6249 46.9106 27.4642 37.0059 8.3498 13.1148 3.3014 22.6691 8.7033 9.5654 160.1504 37.6817 117.9855 13.8456 1.3577 6.1626 0.8623 0.8521 1.2260 4.9993 5.4008 0.7362 7.5237 8.5292 1.2289 3.2764 11.7010 25.0865 16.1309 75.3199 6.6973 10.4252 12.8647 99.9994 19.1522 22.3806 24.1867 42.2160 44.7098 34.1765 72.6069 43.9454 21.0572 19.6440 85.8571 14.8471 17.4356 2.5759 77.7386 53.6752
temp: 298.150 k
press: 1.00000 atm
elementType: 8 8 7 6 6 6 6 6 6 6 6 6 6 6 6 6 1 1 1 1 1 1 1 1 1 1 1 1 1 1 1 1 1
symmnumber: 1
zpe: 729742.2 jmol-1
zpe.correction: 0.277944 hartree
zpe.thermalcorrener: 0.291852 hartree
zpe.thermalcorrenthalpy: 0.292796 hartree
zpe.thermalcorrgfe: 0.238494 hartree
zpe.sumelectzpe: -709.576600 hartree
zpe.sumelectthermal: -709.562693 hartree
zpe.sumelectthermalent: -709.561749 hartree
zpe.sumelectthermalfe: -709.616050 hartree
dipole: -0.8384 -1.4485 0.3735
dipole: 1.7148
quadrupole: -80.6864 -89.3033 -98.9388
quadrupole: 12.0919 2.2967 -0.8438
quadrupole: 8.9564 0.3395 -9.2960 12.0919 2.2967 -0.8438
hfenergy: -709.8545443 hartree
pointgroup: C01 [X(C13H17N1O2)]
dipole: -0.3362977 0.5671639 -0.1427769 debye
polarizability: 199.4226262|-2.2180429|152.76146|1.5342486|4.1859169|95.0235451 unknown
InChI: InChI=1S/C13H17NO2/c15-12-6-4-8-9-2-1-7-14-11(9)5-3-10(8)13(12)16/h4,6,9,11,14-16H,1-3,5,7H2
charge 0 multiplicity 1
33 atoms
O  -2.9748 -1.853948 -0.383447
O  -4.445057 0.3834 -0.176809
N  3.393575 -0.618219 0.760898
C  1.287444 0.649727 0.442499
C  1.91593 -0.744253 0.715795
C  1.933886 1.323755 -0.807855
C  1.361175 -1.795911 -0.285975
C  -0.233643 0.575477 0.303272
C  3.473078 1.375338 -0.683337
C  -0.157372 -1.980738 -0.082888
C  4.034826 -0.040513 -0.441127
C  -0.89732 -0.655219 0.026653
C  -0.993609 1.765159 0.431275
C  -2.303605 -0.64769 -0.118724
C  -2.398164 1.766555 0.281302
C  -3.046215 0.550909 0.000838
H  1.535915 1.289872 1.31379
H  1.597854 -1.063995 1.730441
H  1.517772 2.342524 -0.925865
H  1.647858 0.765487 -1.721785
H  1.877737 -2.763611 -0.13032
H  1.567962 -1.482893 -1.326769
H  3.92083 1.806973 -1.599354
H  3.75692 2.01959 0.171503
H  -0.338815 -2.563399 0.844546
H  -0.599803 -2.582744 -0.89761
H  3.840925 -1.49221 1.065664
H  3.880776 -0.648854 -1.367644
H  5.125111 0.00735 -0.260906
H  -0.47916 2.705799 0.659207
H  -2.970822 2.696326 0.387188
H  -3.946029 -1.658577 -0.4637
H  -4.928761 1.238434 -0.088356
