program: Gaussian 09
title: 000192162
version: EM64L-G09RevD.01
frameworkgroup: C1[X(C8H9O6P)]
method: RPBEPBE
basis: SDD
operation: Freq
keyword: #pfreq=noraman
keyword: PBEPBE/SDD
title: #p freq=noraman PBEPBE/SDD
converged: YES YES NO NO
title: Mulliken charges:
elementType: P O O O O O O C C C C C C C C H H H H H H H H H
charge: 1.342467 -0.546922 -0.269258 -0.660989 -0.641282 -0.575214 -0.203351 0.251169 0.223969 0.436756 -0.478349 -0.303698 -0.394707 -0.205295 -0.508950 0.297489 0.281118 0.241386 0.168478 0.248708 0.247000 0.233123 0.410375 0.405976
chargesum: 0.00000
title: Mulliken charges with hydrogens summed into heavy atoms:
elementType: P O O O O O O C C C C C C C C
charge: 1.342467 -0.546922 -0.269258 -0.250614 -0.235306 -0.575214 -0.203351 0.251169 0.223969 0.436756 -0.180859 -0.022580 -0.153321 -0.036817 0.219881
polarizability: 1.97824690e+02 -6.27024522e+00 1.40194236e+02 8.61966126e+00 2.69335319e+00 7.31739948e+01
1716.lowfreq: -10.6162 -7.9453 -2.9721 -0.0019 -0.0017 -0.0012 29.5878 33.9525 61.5556
frequency: 29.4824 33.5076 61.4781 69.4623 101.0365 137.3635 159.6015 178.9649 182.6431 195.0965 205.6471 229.3288 245.2677 289.0417 307.2886 328.3130 336.8817 366.7764 383.1199 431.5181 449.6962 470.5372 536.2667 592.1450 611.4713 638.5733 694.5009 715.9472 719.1612 750.8418 815.6808 820.1152 893.1478 910.3259 950.4856 994.6313 1007.4864 1010.1133 1030.8920 1067.5213 1093.9631 1108.1860 1154.8840 1164.1068 1173.7466 1256.6717 1261.3380 1371.8061 1385.4412 1410.1010 1450.6172 1463.3358 1473.7626 1478.6481 1572.7045 1595.4205 1625.1355 2871.7264 2999.3975 3110.2479 3130.6490 3137.2370 3158.7668 3165.3404 3594.0519 3598.8602
redmass: 6.9702 5.4750 6.3891 4.1558 5.2279 1.8175 6.8885 3.5416 2.8644 2.8189 4.3465 1.3047 1.5663 3.4644 2.6022 7.0467 5.0916 8.6537 6.0748 5.8072 5.3442 3.8916 7.6612 4.5197 6.8940 8.1145 8.4241 5.9740 4.2813 7.3324 1.4564 4.9124 6.8606 1.4018 1.3589 1.8424 2.0424 1.8984 1.2802 4.3264 2.8070 1.2740 1.3886 2.2358 1.6985 2.3927 1.7635 1.8483 6.1203 1.7861 1.4610 1.0784 1.0699 2.5436 8.1460 6.6331 6.9774 1.0849 1.0293 1.1049 1.1051 1.0882 1.0968 1.0921 1.0664 1.0664
irintensity: 2.5207 2.5102 2.8127 2.6397 21.2203 61.8569 2.3834 13.5202 26.3247 1.9052 47.3168 0.8528 76.9576 13.5110 33.6989 48.3000 35.4368 60.0191 14.7254 6.1122 3.9968 14.3169 19.2846 7.5676 12.8261 12.3180 93.1074 113.1746 43.5702 298.0011 62.6564 132.6269 91.5622 15.0555 4.6917 11.5730 30.9254 21.1127 55.0842 201.0178 79.8162 7.0999 4.7781 33.7791 21.8839 206.8303 82.8628 61.5550 23.2864 80.2718 29.2680 17.1000 43.6806 97.4801 53.1820 191.8882 95.4716 128.8954 46.4680 23.2478 23.9281 4.6313 1.1636 3.8984 114.1411 81.8091
temp: 298.150 k
press: 1.00000 atm
elementType: 15 8 8 8 8 8 8 6 6 6 6 6 6 6 6 1 1 1 1 1 1 1 1 1
symmnumber: 1
zpe: 429205.2 jmol-1
zpe.correction: 0.163476 hartree
zpe.thermalcorrener: 0.179803 hartree
zpe.thermalcorrenthalpy: 0.180747 hartree
zpe.thermalcorrgfe: 0.118553 hartree
zpe.sumelectzpe: -1101.658277 hartree
zpe.sumelectthermal: -1101.641950 hartree
zpe.sumelectthermalent: -1101.641006 hartree
zpe.sumelectthermalfe: -1101.703200 hartree
dipole: -5.5181 -1.2067 0.2453
dipole: 5.6538
quadrupole: -106.9307 -94.3510 -87.4027
quadrupole: -9.7668 -1.1538 1.1618
quadrupole: -10.7026 1.8771 8.8255 -9.7668 -1.1538 1.1618
hfenergy: -1101.821753 hartree
pointgroup: C01 [X(C8H9O6P1)]
dipole: -2.2011491 -0.2398728 0.2127037 debye
dipolederiv: 2.8758616 -0.0505671 0.0962039 0.2070896 1.4961396 -0.0716615 -0.418776 -0.0145633 1.9206181 -2.0538583 0.0750274 0.0844374 -0.081599 -0.4736886 0.0016982 -0.0595892 -0.011989 -0.3884931 -0.4270785 0.4292215 0.0522232 0.5492574 -1.4523353 -0.1824251 0.0887845 -0.0757988 -0.3162166 -0.6904287 0.1190541 -0.0332609 0.0857125 -0.5099274 -0.184468 0.318846 -0.1490282 -1.0409503 -1.1754634 0.1511991 -0.1446328 0.232707 -0.5909731 0.2726975 -0.2038692 0.2193452 -0.5730373 -0.8524991 -0.0611023 -0.0110585 -0.0912667 -0.6496631 -0.0000332 0.0717829 0.002969 -0.6108612 -1.2471462 0.0476139 -0.0347365 -0.3759444 -0.4210394 -0.0316026 -0.1232724 -0.0084734 -0.3357316 1.4021636 -0.2220256 -0.0407948 -0.2447602 -0.0242644 0.066574 0.2209186 0.0320302 0.0036599 -0.3434006 -0.2780083 0.0224631 -0.4681277 1.4259611 0.1463661 0.0129708 0.079661 0.1104362 -0.819279 0.2051846 -0.0072497 0.4902917 -0.0175774 -0.0012942 -0.0048899 0.0159749 0.0178137 0.0748181 0.3453023 0.0556972 -0.2467033 -0.2005451 -0.019369 -0.0325272 -0.0296108 -0.1263243 -0.0993057 0.0919337 0.0308566 0.1772959 -0.1108135 -0.009557 -0.0095941 -0.0010269 -0.1129922 0.0303542 -0.1441302 0.0136647 0.0911924 -0.0379328 0.0220141 0.0196607 0.0029432 -0.1778521 1.8405013 -0.2077399 0.0575516 -0.1191747 0.7597789 0.0824869 0.1329031 0.072147 0.1207502 0.5279481 -0.4479991 -0.0876435 -0.2069252 0.5093943 0.084883 -0.0565581 0.0998796 0.2827428 0.0865971 -0.0613155 -0.0134748 -0.0104148 0.0683484 -0.016675 -0.0098803 -0.0182205 0.1614498 0.0389467 -0.060453 -0.0305936 -0.0586299 0.0765984 -0.0084718 -0.0270706 -0.0064282 0.1593673 0.0663677 0.0621765 0.0046103 0.040349 -0.0579102 -0.0301532 0.0054565 -0.0213848 0.1635408 0.0249672 -0.0351953 -0.0097446 0.1224563 -0.2825839 -0.046585 0.0064463 -0.053617 0.1004929 0.0174233 0.1098367 0.0559177 -0.0154609 0.0408613 0.102157 0.0687815 0.0364697 -0.040646 -0.0663208 0.1160919 -0.054803 0.0017664 0.1054573 -0.0325031 -0.1084723 -0.0164956 -0.0311386 0.0444397 -0.0496957 -0.0039962 -0.0011406 -0.1576205 -0.0668068 0.0078603 -0.0794309 0.104952 0.3087291 -0.1064957 0.0226834 -0.0978782 0.246605 0.0175812 0.0720956 0.0564445 0.351988 0.4356625 -0.0279138 -0.0243203 0.0199074 0.2577302 -0.0948525 0.0279926 -0.1317968 0.2564317 unknown
polarizability: 196.1916601|-12.740347|141.1428956|-0.3238835|9.8187942|73.8583652 unknown
InChI: InChI=1S/C8H9O6P/c1-13-8-4-6(5-9)2-3-7(8)14-15(10,11)12/h2-5,10-11H,1H3
charge 0 multiplicity 1
24 atoms
P  -2.867422 -0.295556 0.424839
O  -1.524622 0.413752 -0.398673
O  0.659469 2.311276 0.15494
O  -2.610816 0.33513 1.99321
O  -4.102022 0.73529 -0.151115
O  -3.112613 -1.857669 0.291073
O  4.905022 -0.561856 0.131009
C  -0.182927 -0.040381 -0.218898
C  0.832315 0.940554 0.010252
C  2.499744 -0.871063 -0.098969
C  2.173962 0.496461 0.052617
C  0.13267 -1.410503 -0.364823
C  1.472072 -1.831238 -0.298688
C  3.914127 -1.319721 -0.043584
C  -0.630354 2.890402 0.594557
H  2.970066 1.229368 0.2179
H  -0.677573 -2.12726 -0.53648
H  1.722994 -2.891937 -0.411624
H  4.055127 -2.423576 -0.171919
H  -1.028344 2.355162 1.473703
H  -1.370114 2.869415 -0.2212
H  -0.37716 3.927736 0.8605
H  -3.087543 -0.13662 2.722587
H  -4.552059 0.426035 -0.978416
