program: Gaussian 09
title: 000192156
version: EM64L-G09RevD.01
frameworkgroup: C1[X(C23H30O6)]
method: RPBEPBE
basis: SDD
operation: Freq
keyword: #pfreq=noraman
keyword: PBEPBE/SDD
title: #p freq=noraman PBEPBE/SDD
converged: NO YES NO NO
title: Mulliken charges:
elementType: O O O O O O C C C C C C C C C C C C C C C C C C C C C C C H H H H H H H H H H H H H H H H H H H H H H H H H H H H H H
charge: -0.470579 -0.469436 -0.185240 -0.227694 -0.255813 -0.273220 0.364222 -0.091419 -0.167773 -0.158232 0.137234 -0.655168 -0.552310 -0.146415 0.135691 -0.550825 -0.471064 -0.861038 -0.646568 0.572226 0.127186 -0.773651 -0.189786 -0.656060 -0.412291 -0.414435 0.182292 0.323795 -0.755528 0.169269 0.255028 0.235962 0.230110 0.268915 0.223905 0.243393 0.220464 0.274193 0.236349 0.228935 0.210550 0.259740 0.264738 0.237464 0.227891 0.234719 0.282304 0.228540 0.215818 0.264527 0.345807 0.358322 0.261814 0.277734 0.276241 0.252743 0.251409 0.262061 0.242953
chargesum: 0.00000
title: Mulliken charges with hydrogens summed into heavy atoms:
elementType: O O O O O O C C C C C C C C C C C C C C C C C C C C C C C
charge: -0.124772 -0.111114 -0.185240 -0.227694 -0.255813 -0.273220 0.364222 0.077849 0.087255 0.077730 0.137234 -0.156143 -0.085011 0.074049 0.135691 -0.040283 -0.031579 -0.099097 -0.183959 0.572226 0.127186 -0.046989 0.074741 -0.394245 0.141684 -0.161692 0.182292 0.323795 0.000895
polarizability: 3.35736314e+02 3.62055672e+00 2.39239185e+02 -2.95943411e+01 -6.12873694e+00 2.10348375e+02
1716.lowfreq: -7.7386 -0.0005 -0.0005 0.0005 8.8829 10.7216 25.8443 31.5381 41.2233
frequency: 25.3798 31.5024 41.1892 57.0042 61.1146 68.3993 80.2409 85.5720 97.5302 126.2803 136.2646 159.0067 167.6936 184.7116 202.3546 213.4202 214.7837 219.5844 226.1606 244.7548 254.2567 265.1868 271.7417 287.2464 289.2044 304.0226 309.8151 320.8652 329.4935 346.7999 351.0873 367.5791 375.4729 401.2964 413.0040 419.6925 432.6926 449.4613 455.2793 477.4940 495.0680 517.5466 524.7381 538.2637 561.6214 567.1414 575.0059 619.5092 629.2568 640.1318 667.8526 689.2646 696.6661 733.5365 754.8464 760.6351 787.0811 795.4003 797.7544 822.2314 831.1018 851.2918 862.5386 877.9344 890.3443 902.7865 912.3862 922.0072 932.7933 940.2420 951.5410 960.4495 973.1115 979.3871 1002.6905 1004.8330 1010.2804 1015.8439 1029.4894 1032.4453 1034.8904 1043.5304 1053.6795 1067.6904 1079.7360 1095.3833 1102.4876 1105.3806 1112.2495 1116.6262 1132.7351 1143.5016 1152.4877 1159.7080 1175.0076 1182.7602 1204.2551 1209.4548 1217.6613 1226.2736 1226.6353 1244.7325 1250.4271 1268.3578 1271.3550 1280.1926 1288.3084 1292.6447 1297.7471 1310.0992 1313.9602 1319.5311 1322.1679 1337.2115 1346.8750 1348.4953 1348.9324 1358.2352 1364.9151 1377.1277 1383.4624 1385.0989 1394.2590 1409.4573 1411.2992 1452.6092 1453.0389 1461.1390 1462.1977 1467.2601 1468.6662 1471.4449 1475.8056 1488.7423 1496.8650 1507.7792 1555.0438 1610.6148 1632.1318 1643.3422 1660.2387 2864.1652 2927.7141 2944.6542 2960.2303 2971.9648 2976.6849 2996.6006 3002.2245 3003.9555 3005.4043 3008.2002 3019.3165 3029.6403 3036.3072 3044.1525 3047.0466 3060.0684 3083.4814 3086.9774 3092.1649 3101.4585 3108.4045 3110.5017 3113.5968 3125.5283 3126.2213 3142.9251 3148.2157 3553.6897 3573.0423
redmass: 6.1343 5.7181 5.1939 1.5513 4.6029 2.3544 4.0796 4.5059 4.2250 4.5114 3.5269 5.1926 3.0004 4.5232 1.9032 2.8971 1.7854 3.1739 2.3057 3.2493 1.7415 2.0753 2.6933 2.3307 1.9116 3.7517 2.7589 4.3865 3.1367 1.4908 2.1261 2.9071 3.4811 3.3475 3.6833 3.2811 3.6576 2.9096 3.0387 3.5206 3.5826 3.6562 3.2751 4.1059 3.1747 3.3397 3.1520 4.6976 3.9978 4.4500 4.0619 3.2081 3.2053 3.9103 4.6745 4.0046 2.8709 2.7412 2.4514 1.9350 1.7709 2.3928 3.0342 2.6949 2.9749 1.8838 1.8209 2.2918 2.2554 2.1895 1.9309 2.1155 2.4632 2.6923 1.9472 1.4237 2.9191 2.6583 2.3262 2.3557 2.0870 1.6581 3.1187 2.3449 3.0223 1.8843 2.0044 2.6362 1.7945 2.1221 1.8073 1.6172 1.5720 2.3265 1.8434 1.4114 1.7129 1.7003 1.5194 1.3509 1.4174 1.5442 1.4466 1.3420 1.4332 1.3682 1.7881 1.7140 1.4340 1.4612 1.3410 1.3876 1.4186 1.4269 1.6624 1.5509 1.6544 1.4408 1.4635 2.3126 1.4225 1.2398 1.3041 1.1358 1.1383 1.0583 1.0570 1.0769 1.0755 1.0875 1.0771 1.0761 1.0752 1.0814 1.0553 1.0536 8.5753 8.5143 9.2700 9.8195 7.3791 1.0796 1.0807 1.0816 1.0641 1.0636 1.0622 1.0388 1.0573 1.0636 1.0558 1.0381 1.0633 1.0999 1.0961 1.0586 1.1000 1.1020 1.1030 1.0988 1.0986 1.0944 1.0867 1.0991 1.1036 1.0924 1.0981 1.1024 1.0978 1.0660 1.0660
irintensity: 2.6643 0.5191 1.6797 1.1381 2.1826 0.6487 1.5742 4.4158 2.7098 3.7354 1.7427 1.2841 1.0413 1.8646 12.6718 38.6252 73.9299 27.6634 32.2209 5.0422 3.2705 2.4545 4.9494 12.1555 12.7368 3.7104 1.7697 9.5268 4.2042 91.2723 32.5686 2.1552 0.3717 6.5898 15.5767 2.8254 14.8574 2.1780 0.8253 7.0662 11.2599 2.7975 2.4953 8.4576 1.3868 4.4960 2.3126 2.1097 3.4163 1.8614 4.3921 8.9409 4.9950 11.5101 9.8896 5.0963 7.1357 11.9951 2.9736 13.1092 6.5792 17.4110 0.2675 2.0562 36.3686 26.4548 13.1139 19.6044 19.4708 18.6079 18.9342 6.3812 30.9568 4.3772 0.9733 0.3829 95.6846 5.1549 4.4654 1.9406 6.6105 10.0835 5.7136 45.6874 19.4947 88.2778 12.1495 39.7314 3.3501 0.8493 11.8234 2.4672 15.8401 5.2285 6.9522 12.9974 124.4046 20.7586 28.2132 4.6747 70.9030 18.8977 2.3252 1.7509 6.1177 5.3642 10.7229 26.2906 6.8381 13.6319 10.1853 9.7468 12.9043 7.6566 18.8029 6.7766 4.9274 7.5778 3.3769 15.7572 0.5537 59.5498 20.8912 63.2255 2.9232 26.4485 22.9165 7.8010 17.4500 3.4966 14.9035 1.9875 20.2574 2.9781 7.5301 6.8278 192.8111 12.3697 245.4555 55.3341 161.7101 33.7669 10.6557 36.5789 28.3373 32.0925 19.5157 21.6745 5.6288 15.8756 29.6200 0.9077 21.9285 9.2975 53.1959 5.7677 31.1970 15.7477 20.9124 34.6867 10.9508 7.9971 5.3306 11.6488 2.1928 7.7238 7.5441 6.8639 14.0361 5.3906 3.6624
temp: 298.150 k
press: 1.00000 atm
elementType: 8 8 8 8 8 8 6 6 6 6 6 6 6 6 6 6 6 6 6 6 6 6 6 6 6 6 6 6 6 1 1 1 1 1 1 1 1 1 1 1 1 1 1 1 1 1 1 1 1 1 1 1 1 1 1 1 1 1 1
symmnumber: 1
zpe: 1280962.3 jmol-1
zpe.correction: 0.487893 hartree
zpe.thermalcorrener: 0.516107 hartree
zpe.thermalcorrenthalpy: 0.517052 hartree
zpe.thermalcorrgfe: 0.430554 hartree
zpe.sumelectzpe: -1343.561861 hartree
zpe.sumelectthermal: -1343.533646 hartree
zpe.sumelectthermalent: -1343.532702 hartree
zpe.sumelectthermalfe: -1343.619200 hartree
dipole: 5.0400 2.0750 -0.9105
dipole: 5.5260
quadrupole: -220.1828 -160.0796 -176.3206
quadrupole: -23.3259 19.0667 4.0769
quadrupole: -34.6551 25.4481 9.2071 -23.3259 19.0667 4.0769
hfenergy: -1344.0497537 hartree
pointgroup: C01 [X(C23H30O6)]
dipole: -1.9470295 -0.9543207 -0.1580508 debye
polarizability: 334.8636308|14.0431679|241.41664|27.7882341|0.1055109|209.0436022 unknown
InChI: InChI=1S/C23H30O6/c1-13(24)29-12-19(27)23(28)9-7-17-16-5-4-14-10-15(25)6-8-21(14,2)20(16)18(26)11-22(17,23)3/h6,8,10,16-18,20,26,28H,4-5,7,9,11-12H2,1-3H3
charge 0 multiplicity 1
59 atoms
O  -2.241621 -0.973459 2.343897
O  0.308599 1.504306 -1.698576
O  -4.423751 -1.429711 -0.401079
O  -5.480121 0.905695 0.657418
O  6.436627 1.891786 1.443871
O  -3.982573 1.799981 -0.885458
C  -1.232131 -0.709487 0.013114
C  -0.040215 -1.646395 0.384381
C  1.265701 -1.303357 -0.364626
C  1.637841 0.185245 -0.06945
C  -2.369224 -1.371487 0.920636
C  -0.85983 0.740643 0.384015
C  -0.636547 -3.071933 0.27148
C  0.476272 1.20303 -0.25712
C  3.016446 0.600563 -0.765549
C  -2.125065 -2.902168 0.73397
C  2.40919 -2.24203 0.100043
C  -1.634435 -0.827913 -1.482597
C  3.804711 -1.832764 -0.445715
C  4.070352 -0.360106 -0.208019
C  -3.773659 -0.90026 0.532218
C  2.987191 0.472937 -2.33048
C  3.330851 2.051348 -0.457948
C  5.158888 0.077426 0.497648
C  -4.332042 0.28251 1.340969
C  4.427388 2.469251 0.236019
C  5.417345 1.506279 0.77782
C  -5.164452 1.620991 -0.503045
C  -6.415507 2.10681 -1.190976
H  0.190982 -1.464719 1.46438
H  1.106229 -1.438222 -1.451908
H  1.852731 0.23373 1.023365
H  -0.763719 0.822272 1.484856
H  -1.661169 1.443759 0.078741
H  -0.091786 -3.805231 0.891095
H  -0.588861 -3.427689 -0.774165
H  0.772556 2.145969 0.251758
H  -2.832521 -3.297636 -0.014443
H  -2.334964 -3.419553 1.687287
H  2.188143 -3.28305 -0.203265
H  2.446009 -2.228595 1.209833
H  -2.419919 -0.091324 -1.724614
H  -0.771819 -0.621314 -2.134431
H  -2.038389 -1.823754 -1.729294
H  3.841833 -2.051082 -1.531908
H  4.59096 -2.445163 0.031731
H  2.261914 1.184835 -2.750074
H  3.993797 0.683759 -2.734019
H  2.691731 -0.538689 -2.656085
H  2.633302 2.78367 -0.885781
H  -1.392583 -1.333381 2.702309
H  -0.578965 1.92607 -1.826776
H  5.896932 -0.630866 0.895103
H  -3.541518 1.02411 1.540763
H  -4.726908 -0.078696 2.304032
H  4.631834 3.531667 0.413367
H  -7.183953 2.390198 -0.454842
H  -6.826472 1.284254 -1.804469
H  -6.177836 2.954337 -1.850506
