program: Gaussian 09
title: 000192152
version: EM64L-G09RevD.01
frameworkgroup: C1[X(C11H16ClN5)]
method: RPBEPBE
basis: SDD
operation: Freq
keyword: #p
keyword: freq=noraman
keyword: PBEPBE/SDD
title: #p freq=noraman PBEPBE/SDD
converged: YES YES NO NO
title: Mulliken charges:
elementType: Cl N N N N N C C C C C C C C C C C H H H H H H H H H H H H H H H H
charge: -0.056262 -0.356002 -0.260316 -0.674357 -0.658497 -0.402315 -0.095377 0.369947 0.361964 -0.677506 -0.690101 -0.298737 -0.298766 0.161726 -0.199192 -0.199821 -0.115194 0.166626 0.209299 0.214618 0.227476 0.213712 0.201672 0.227903 0.254822 0.256757 0.255746 0.256087 0.329708 0.345094 0.295506 0.413359 0.220423
chargesum: 0.00000
title: Mulliken charges with hydrogens summed into heavy atoms:
elementType: Cl N N N N N C C C C C C C C C C C
charge: -0.056262 -0.356002 -0.260316 0.000444 0.050368 -0.181892 0.071248 0.369947 0.361964 -0.026113 -0.046814 -0.043915 -0.042009 0.161726 0.056555 0.056266 -0.115194
polarizability: 2.47443135e+02 -6.75293220e+00 1.41514041e+02 -6.75841757e-01 -1.94397039e+00 1.23209033e+02
1716.lowfreq: -16.2133 -7.8946 -0.5189 0.0010 0.0016 0.0020 14.7353 26.2070 42.1148
frequency: 11.5325 25.8468 42.0259 59.2241 66.5788 99.6691 124.7678 135.1695 169.5185 200.1295 210.3948 244.0000 259.9044 280.5980 348.3824 357.6150 371.6654 384.8496 396.7513 403.3089 413.4070 415.3976 435.9248 447.5162 469.9897 496.6791 506.7920 578.6804 621.8778 660.0745 676.3085 682.8078 711.6882 713.7516 738.9067 821.7148 822.8503 824.6677 906.7815 917.1510 917.3924 943.7347 946.0735 962.9012 968.0919 1000.9162 1030.0264 1066.7435 1067.7743 1097.5171 1100.3838 1130.9364 1132.8740 1143.9929 1172.2806 1183.1383 1270.5036 1282.9612 1295.3726 1344.7443 1362.3226 1373.2114 1380.8816 1386.1265 1387.2479 1394.6561 1457.3050 1467.3095 1472.4708 1474.4999 1485.8931 1561.7227 1585.8756 1586.4197 1594.4604 1615.1072 1644.3005 2860.1742 2936.4380 2977.6284 2983.7063 3072.8328 3080.5913 3086.9567 3091.0825 3156.0582 3156.8884 3175.2436 3179.0316 3392.4313 3555.0706 3628.2963 3700.2649
redmass: 3.8970 3.4301 7.4515 4.7676 4.0781 4.7989 4.1943 4.2256 5.4769 1.0594 4.8016 1.1794 6.2084 3.1536 4.2743 2.7683 1.5485 2.4234 1.5199 1.3107 2.6913 2.5223 3.2100 2.8406 4.2237 2.8603 3.0378 2.9085 6.5921 9.8733 4.3721 3.4968 3.6009 1.6071 3.6731 2.5383 1.2835 1.6206 2.7940 1.0822 1.1773 1.4682 1.3473 1.3664 3.4624 3.5220 1.8255 2.6441 2.3548 1.3423 2.3803 1.9572 2.0427 1.9083 1.1156 2.1369 3.7183 1.2466 1.3906 1.3297 6.6062 1.2568 2.3241 2.6845 3.4124 1.5919 1.0486 1.0488 1.0580 2.5933 1.0514 1.7235 4.5405 1.9332 5.3148 2.4913 3.4770 1.0822 1.0773 1.0350 1.0353 1.1001 1.1002 1.0996 1.1000 1.0892 1.0891 1.0970 1.0979 1.0768 1.0457 1.0829 1.1033
irintensity: 0.2423 0.0133 0.2116 0.0221 0.6073 1.5993 2.0791 0.9757 3.6537 0.6084 3.1096 0.8356 11.0794 1.5362 33.3661 13.2835 68.9923 26.5157 16.3839 149.6116 9.8110 27.9813 1.2105 3.9625 19.4539 30.0564 11.9568 47.3202 0.5902 0.3948 9.8752 7.0727 24.3843 126.7413 4.8489 1.6169 0.7790 37.8141 4.0002 80.6235 6.7436 2.4991 2.3436 0.6267 38.7889 36.5897 168.0598 44.6406 14.4973 11.0730 39.3903 31.6085 9.0088 5.7132 0.2472 47.1273 13.8680 0.0472 35.7201 95.2543 1.2188 36.5066 66.5194 139.3094 13.9459 77.0398 6.3536 2.3429 8.9647 138.1081 9.5075 463.1422 37.6519 159.0368 20.1961 218.1143 647.6826 113.5896 656.6328 25.7086 29.8783 40.9306 6.3788 64.3882 37.8143 1.4089 5.3922 5.0523 0.0652 21.8398 37.7829 36.9979 52.4361
temp: 298.150 k
press: 1.00000 atm
elementType: 17 7 7 7 7 7 6 6 6 6 6 6 6 6 6 6 6 1 1 1 1 1 1 1 1 1 1 1 1 1 1 1 1
symmnumber: 1
zpe: 690100.3 jmol-1
zpe.correction: 0.262845 hartree
zpe.thermalcorrener: 0.280964 hartree
zpe.thermalcorrenthalpy: 0.281909 hartree
zpe.thermalcorrgfe: 0.214482 hartree
zpe.sumelectzpe: -1161.309973 hartree
zpe.sumelectthermal: -1161.291854 hartree
zpe.sumelectthermalent: -1161.290910 hartree
zpe.sumelectthermalfe: -1161.358336 hartree
dipole: -3.3211 -2.5921 -0.4947
dipole: 4.2418
quadrupole: -114.1507 -100.9617 -104.1661
quadrupole: -1.5167 -0.5472 0.8047
quadrupole: -7.7245 5.4645 2.2600 -1.5167 -0.5472 0.8047
hfenergy: -1161.5728181 hartree
pointgroup: C01 [X(C11H16Cl1N5)]
dipole: -1.3696294 0.9118467 0.2788756 debye
polarizability: 237.2804034|-2.9758426|139.152423|34.4399633|5.2725358|135.7333827 unknown
InChI: InChI=1S/C11H16ClN5/c1-7(2)16-11(15)17(10(13)14)9-5-3-8(12)4-6-9/h3-7,13H,14-15H2,1-2H3
charge 0 multiplicity 1
33 atoms
Cl 5.312477 0.373931 2.01111
N  -0.253811 -0.571557 -0.245651
N  -2.505196 0.207618 -0.401624
N  -0.899324 1.350232 0.976174
N  -1.664964 -1.910459 -1.620689
N  0.692259 -2.456486 -1.260604
C  -3.584029 1.157088 -0.047663
C  1.083227 -0.359213 0.28669
C  -1.288201 0.342128 0.095001
C  -3.504119 2.437479 -0.922345
C  -4.93851 0.443865 -0.237847
C  1.996137 0.466199 -0.40828
C  1.464373 -0.966225 1.504882
C  -0.399533 -1.733646 -1.099234
C  3.289544 0.694262 0.111293
C  2.754015 -0.748105 2.037703
C  3.644608 0.082695 1.329591
H  -3.521347 1.459659 1.027558
H  -4.314565 3.142873 -0.660557
H  -2.535821 2.957845 -0.803618
H  -3.609481 2.164428 -1.98756
H  -5.055073 0.131917 -1.29178
H  -5.777629 1.114009 0.024706
H  -4.9946 -0.458733 0.395282
H  1.698634 0.911493 -1.362568
H  0.759514 -1.626692 2.018921
H  4.005559 1.324995 -0.422971
H  3.060908 -1.219794 2.975348
H  -1.580353 2.043753 1.268019
H  0.036775 1.37637 1.372147
H  -1.841049 -2.711544 -2.220988
H  -2.382304 -1.184996 -1.347136
H  0.544885 -3.271387 -1.883009
