program: Gaussian 09
title: 000192150
version: EM64L-G09RevD.01
frameworkgroup: C1[X(C14H10O4)]
method: RPBEPBE
basis: SDD
operation: Freq
keyword: #pfreq=noraman
keyword: PBEPBE/SDD
title: #p freq=noraman PBEPBE/SDD
converged: YES YES NO NO
title: Mulliken charges:
elementType: O O O O C C C C C C C C C C C C C C H H H H H H H H H H
charge: -0.400943 -0.215424 -0.417351 -0.326015 0.358632 0.011000 0.294570 -0.487669 -0.386525 0.091304 0.156692 -0.319133 -0.357645 -0.356030 -0.235613 -0.230587 -0.226918 0.171121 0.297212 0.275856 0.273429 0.266084 0.273128 0.234611 0.234946 0.235293 0.391710 0.394267
chargesum: 0.00000
title: Mulliken charges with hydrogens summed into heavy atoms:
elementType: O O O O C C C C C C C C C C C C C C
charge: -0.009233 -0.215424 -0.023084 -0.326015 0.358632 0.011000 0.294570 -0.190457 -0.110670 0.091304 0.156692 -0.045705 -0.091561 -0.082902 -0.001003 0.004359 0.008375 0.171121
polarizability: 2.69285807e+02 -5.70006504e+00 1.65758161e+02 -1.37896719e+01 -2.77817093e+00 8.59795614e+01
1716.lowfreq: -7.6660 -3.2144 -0.0006 0.0004 0.0006 3.9506 33.4991 50.4176 60.6663
frequency: 33.3166 50.3729 60.6549 97.0348 112.9835 152.0412 168.4521 225.0149 238.6241 256.9028 272.7084 349.6986 380.8663 405.0461 416.2785 437.3534 463.3706 494.6925 530.2450 563.3026 580.3828 598.6097 613.3954 642.4329 677.8298 684.8996 702.0378 723.5121 727.6675 767.9394 801.7181 841.0092 853.9786 862.8905 869.9814 914.7562 948.9838 965.5143 987.8189 989.3186 992.3396 1007.0795 1026.1086 1027.1121 1085.4786 1114.1310 1138.4814 1172.8021 1175.4338 1190.7134 1230.4765 1235.5313 1294.1061 1313.2060 1320.2828 1381.7163 1384.5536 1403.0765 1434.0167 1439.2569 1474.7666 1481.1842 1536.3575 1562.6513 1580.5381 1587.4638 1608.1417 1647.2554 3050.3407 3130.4394 3140.7112 3151.6399 3160.9982 3162.4182 3170.7591 3175.4021 3182.0328 3529.1998
redmass: 6.5800 4.9722 5.6810 6.3387 9.2057 6.5122 6.9877 6.0688 5.3563 5.7077 6.8241 8.6192 6.9604 2.8979 4.1318 3.5289 9.9348 5.0672 5.1184 6.7193 1.5331 2.8442 6.4436 5.7555 4.5218 5.4770 2.1290 2.8096 3.2708 3.5311 2.2297 1.1570 2.1068 1.2581 3.3229 1.5233 1.4522 3.4861 1.3725 5.6989 1.3959 1.3360 2.8137 3.3511 1.5899 1.9793 1.8844 1.5508 1.0632 1.1208 2.8730 1.4347 4.1600 1.6936 1.3751 3.6402 8.5205 10.7669 2.2729 2.7100 2.3799 2.7694 8.0892 4.6554 6.6110 6.5527 6.0589 5.1404 1.0681 1.0853 1.0882 1.0925 1.0962 1.0880 1.1011 1.0923 1.0975 1.0642
irintensity: 2.5668 1.0803 1.2459 1.0173 0.0777 1.6889 1.5765 0.7849 1.1584 4.4373 0.2285 1.7809 23.7836 0.3330 7.2479 12.3002 7.7280 3.6001 31.4227 0.9692 73.8180 55.9058 0.7649 1.7017 23.6289 37.3680 29.7692 84.4541 36.4313 4.5810 12.7274 174.4544 19.0424 6.3442 41.9558 10.1983 3.1022 68.9086 4.4218 4.4540 4.0733 1.1485 123.9878 159.4660 9.1603 92.1784 35.6784 131.9912 0.7529 14.8519 50.9232 125.3955 264.0551 171.6997 17.8996 104.9375 4.2040 6.5378 33.1679 95.5787 25.7649 64.1443 217.2805 21.3340 124.1258 4.2993 19.4637 183.4802 280.9520 0.1565 5.2996 16.9211 19.2020 0.1728 18.9750 1.9971 0.9455 85.3966
temp: 298.150 k
press: 1.00000 atm
elementType: 8 8 8 8 6 6 6 6 6 6 6 6 6 6 6 6 6 6 1 1 1 1 1 1 1 1 1 1
symmnumber: 1
zpe: 539287.6 jmol-1
zpe.correction: 0.205404 hartree
zpe.thermalcorrener: 0.220052 hartree
zpe.thermalcorrenthalpy: 0.220996 hartree
zpe.thermalcorrgfe: 0.162640 hartree
zpe.sumelectzpe: -839.158256 hartree
zpe.sumelectthermal: -839.143608 hartree
zpe.sumelectthermalent: -839.142664 hartree
zpe.sumelectthermalfe: -839.201020 hartree
dipole: -0.3651 -1.1753 1.5036
dipole: 1.9431
quadrupole: -75.8425 -111.4143 -104.1740
quadrupole: -13.7357 -4.3690 -2.3223
quadrupole: 21.3011 -14.2707 -7.0304 -13.7357 -4.3690 -2.3223
hfenergy: -839.3636601 hartree
pointgroup: C01 [X(C14H10O4)]
dipole: 0.1409527 -0.7489625 0.059918 debye
polarizability: 268.1971019|-10.6802167|112.4011844|-16.8175641|-37.195909|140.4252436 unknown
InChI: InChI=1S/C14H10O4/c15-12-8-10(6-7-11(12)14(17)18)13(16)9-4-2-1-3-5-9/h1-8,15,17H
charge 0 multiplicity 1
28 atoms
O  2.215469 -0.576377 2.074987
O  -1.670922 1.629578 -1.895134
O  5.048896 -0.253243 -1.084643
O  4.640096 -0.722306 1.145381
C  0.024789 0.398436 -0.729905
C  -1.416199 0.7534 -1.010352
C  -2.531892 0.088473 -0.259083
C  0.465618 0.026169 0.557416
C  0.963582 0.535049 -1.79775
C  2.781012 -0.110284 -0.283739
C  1.839639 -0.226473 0.796287
C  2.319081 0.274481 -1.57542
C  -2.419204 -1.220053 0.285986
C  -3.772352 0.77706 -0.160737
C  -3.524829 -1.820649 0.926349
C  -4.868633 0.182434 0.4927
C  -4.747211 -1.119009 1.039475
C  4.19172 -0.38494 -0.002726
H  -0.222795 -0.045903 1.403433
H  0.59795 0.855682 -2.777054
H  3.049695 0.363978 -2.384277
H  -1.483484 -1.778889 0.183273
H  -3.85027 1.773293 -0.608514
H  -3.434236 -2.833787 1.332578
H  -5.816596 0.724924 0.575131
H  -5.601657 -1.58412 1.543694
H  3.224427 -0.721932 2.086887
H  5.978306 -0.45529 -0.792844
