program: Gaussian 09
title: 000192139
version: EM64L-G09RevD.01
frameworkgroup: C1[X(C11H14NO6)]
method: RPBEPBE
basis: SDD
operation: Freq
keyword: #p
keyword: freq=noraman
keyword: PBEPBE/SDD
title: #p freq=noraman PBEPBE/SDD
converged: YES YES NO NO
title: Mulliken charges:
elementType: O O O O O O N C C C C C C C C C C C H H H H H H H H H H H H H H
charge: -0.282758 -0.473191 -0.426486 -0.476252 -0.425694 -0.191927 -0.108522 -0.059068 -0.182234 -0.015083 -0.133238 -0.329888 -0.170262 -0.135033 0.212527 -0.170610 -0.229150 0.162404 0.273424 0.274754 0.271913 0.256992 0.227843 0.258446 0.396958 0.374978 0.358769 0.336624 0.382097 0.282923 0.317812 0.420932
chargesum: 1.00000
title: Mulliken charges with hydrogens summed into heavy atoms:
elementType: O O O O O O N C C C C C C C C C C C
charge: -0.282758 -0.076233 -0.051508 -0.094155 -0.004762 -0.191927 -0.108522 0.214357 0.092520 0.256831 0.123754 0.156401 0.188507 0.201591 0.212527 0.112312 0.088662 0.162404
polarizability: 1.99458358e+02 2.80299249e+00 1.40835991e+02 9.40497303e+00 -1.33915306e+01 9.36285339e+01
1716.lowfreq: -3.9901 -0.0004 0.0006 0.0008 5.6395 8.8888 31.9649 46.1758 55.9730
frequency: 31.6972 46.1534 55.9485 81.4577 111.3979 126.4683 166.2853 195.7156 225.5019 233.9351 253.3119 260.0554 297.1912 313.1074 363.6131 368.1338 382.2063 399.6178 414.6678 435.2839 453.0919 489.4475 517.6164 532.3842 567.0604 604.1076 605.5978 628.5050 635.8728 686.7803 719.8145 720.9807 765.2795 830.6407 843.9213 876.4567 885.8706 911.2771 930.5312 981.3409 993.9273 1004.0765 1013.1970 1026.4101 1026.8924 1036.6509 1048.7563 1050.4876 1077.4666 1095.1092 1113.1545 1129.6692 1173.6276 1181.1336 1196.0249 1211.7612 1227.5435 1246.7037 1272.0136 1283.4920 1291.3203 1304.6607 1321.9943 1341.2225 1348.0067 1358.0296 1374.0022 1374.2133 1383.1123 1385.3242 1437.4017 1451.0912 1485.8225 1578.1635 1620.8338 1662.7895 2977.3988 2982.1245 3001.1636 3005.0521 3050.7619 3112.3444 3171.7541 3196.5589 3213.2290 3219.4911 3487.1079 3531.3167 3533.2977 3600.1418
redmass: 5.6223 7.3578 8.3771 6.3873 6.3827 5.5608 4.6284 5.1217 5.0586 4.9182 6.0060 4.6985 6.1681 1.3372 2.4338 3.5789 4.6680 4.5118 3.0825 2.2056 1.6249 6.1667 4.0812 4.3060 1.1524 2.7999 4.5761 1.4261 5.2427 2.5695 3.7434 5.8044 5.1641 4.1392 1.4741 4.3646 2.1759 3.4984 1.6513 1.4079 2.7451 2.7753 5.4087 1.8088 1.9255 3.1927 4.7489 3.6022 3.9130 2.4152 1.6509 1.8850 1.4781 1.7951 1.2029 1.3230 1.1718 1.2241 1.2975 1.3838 1.3910 1.6546 1.4383 2.6297 1.4157 1.2745 1.4932 1.7404 1.6375 1.2888 2.5058 1.0869 2.5599 6.0134 5.8738 9.7353 1.0839 1.0686 1.0850 1.0850 1.0863 1.0983 1.0932 1.0946 1.0956 1.0989 1.0649 1.0650 1.0657 1.0674
irintensity: 0.5674 0.0882 3.1442 2.5359 3.4384 1.5749 2.1752 4.6222 4.1517 2.3867 13.2010 24.5814 10.4392 84.7464 15.3868 5.6299 15.4110 5.9067 6.2625 47.5521 38.0446 5.8045 1.4328 6.5066 233.8073 26.6838 31.7152 143.4455 25.1462 13.5101 93.4586 18.4493 30.1346 15.4216 30.6231 41.4383 2.8620 7.9616 9.2350 2.1641 47.5456 38.1321 5.9532 32.6799 39.7783 251.9644 37.1085 60.6961 78.6755 79.9145 26.7855 54.1397 33.9984 36.3568 7.7478 29.5589 13.2734 64.4282 19.5518 1.9995 11.6434 17.2753 13.9885 95.0112 5.6177 7.6745 6.9651 3.4272 2.5770 36.2148 39.2864 14.5844 37.6494 11.4495 2.6170 247.6837 7.7278 18.4463 17.7988 32.9304 18.8676 6.4082 4.9829 6.9205 23.8758 13.5539 52.1187 102.2531 61.4707 37.2118
temp: 298.150 k
press: 1.00000 atm
elementType: 8 8 8 8 8 8 7 6 6 6 6 6 6 6 6 6 6 6 1 1 1 1 1 1 1 1 1 1 1 1 1 1
symmnumber: 1
zpe: 652898.8 jmol-1
zpe.correction: 0.248676 hartree
zpe.thermalcorrener: 0.265213 hartree
zpe.thermalcorrenthalpy: 0.266158 hartree
zpe.thermalcorrgfe: 0.204222 hartree
zpe.sumelectzpe: -932.047658 hartree
zpe.sumelectthermal: -932.031121 hartree
zpe.sumelectthermalent: -932.030177 hartree
zpe.sumelectthermalfe: -932.092113 hartree
dipole: 2.4199 3.3798 1.1992
dipole: 4.3263
quadrupole: -55.6398 -83.7935 -94.3787
quadrupole: 10.3483 0.7583 -5.8392
quadrupole: 22.2975 -5.8562 -16.4414 10.3483 0.7583 -5.8392
hfenergy: -932.2963344 hartree
pointgroup: C01 [X(C11H14N1O6)]
dipole: -0.9461963 1.308622 -0.5379441 debye
polarizability: 199.3989003|-2.5728925|142.0428343|9.8008579|10.9954019|92.4811475 unknown
InChI: InChI=1S/C11H14NO6/c13-7-5-18-10(9(15)8(7)14)12-3-1-2-6(4-12)11(16)17/h1-4,7-10,13-16H,5H2
charge 1 multiplicity 1
32 atoms
O  -1.736481 1.310543 -0.965533
O  -0.690324 -1.979976 0.34331
O  -3.537462 -2.080242 0.869747
O  -3.995331 0.627565 0.971694
O  3.568529 -2.042819 -0.675413
O  5.072758 -0.543598 0.300326
N  0.432889 0.600201 -0.375053
C  -1.548518 -0.80856 0.270439
C  -2.986347 -1.203196 -0.153042
C  -0.938065 0.123132 -0.798211
C  -3.842779 0.059431 -0.376429
C  -3.13734 1.012671 -1.362292
C  1.48032 -0.286237 -0.459556
C  0.593303 1.870766 0.129387
C  2.756838 0.103811 -0.023168
C  1.855341 2.290854 0.574582
C  2.95184 1.405644 0.502072
C  3.928707 -0.832404 -0.101023
H  -1.599462 -0.270655 1.239632
H  -2.943427 -1.810237 -1.075494
H  -0.806461 -0.433833 -1.750641
H  -4.825609 -0.226467 -0.803053
H  -3.138427 0.569077 -2.379574
H  -3.620578 2.000711 -1.398679
H  -1.166311 -2.683352 0.859181
H  -3.902826 -1.498981 1.592362
H  1.271448 -1.284091 -0.847326
H  -0.301528 2.49399 0.138895
H  -4.785723 1.218546 1.027855
H  1.967469 3.303053 0.968729
H  3.952554 1.696078 0.838015
H  4.343806 -2.665022 -0.723533
