program: Gaussian 09
title: 000192138
version: EM64L-G09RevD.01
frameworkgroup: C1[X(C11H13NO6)]
method: RPBEPBE
basis: SDD
operation: Freq
keyword: #p
keyword: freq=noraman
keyword: PBEPBE/SDD
title: #p freq=noraman PBEPBE/SDD
converged: YES YES NO NO
title: Mulliken charges:
elementType: O O O O O O N C C C C C C C C C C C H H H H H H H H H H H H H
charge: -0.281366 -0.437425 -0.435333 -0.446846 -0.356538 -0.348358 -0.095126 -0.059322 -0.175000 -0.040247 -0.136759 -0.387402 -0.240948 -0.157233 0.169248 -0.200193 -0.280420 0.112616 0.220126 0.264660 0.264388 0.267083 0.225209 0.269425 0.381935 0.368376 0.334037 0.286574 0.355764 0.247122 0.311954
chargesum: 0.00000
title: Mulliken charges with hydrogens summed into heavy atoms:
elementType: O O O O O O N C C C C C C C C C C C
charge: -0.281366 -0.055490 -0.066957 -0.091082 -0.356538 -0.348358 -0.095126 0.160804 0.089659 0.224141 0.130324 0.107232 0.093089 0.129341 0.169248 0.046928 0.031534 0.112616
polarizability: 2.17317152e+02 2.27150748e+01 1.46403051e+02 3.89708117e+00 -2.30467756e+01 1.06658748e+02
1716.lowfreq: -0.0002 0.0001 0.0008 3.5825 5.3795 13.0630 26.3859 41.7853 54.3252
frequency: 24.9176 41.7703 54.1349 81.7977 103.9853 111.0049 132.1248 188.6799 213.9574 235.9487 243.9595 250.1699 286.9446 352.7149 367.4733 382.9353 390.5606 396.6442 405.5690 408.4862 437.1945 496.6278 507.4843 542.8724 559.6598 608.5192 631.0237 645.7094 674.9528 716.2302 725.2030 767.5880 805.6911 815.2471 877.8997 887.8385 898.8193 906.8324 938.0943 987.3364 997.5949 999.7344 1006.4677 1023.6795 1033.0948 1054.0847 1064.3812 1079.1991 1099.2927 1126.0656 1168.4431 1178.3523 1185.0478 1200.7377 1210.1825 1227.6921 1248.4151 1257.1998 1273.5279 1292.5064 1300.3828 1316.3944 1346.4434 1353.3967 1361.6794 1374.6617 1383.9726 1403.5729 1431.4144 1450.9994 1458.1242 1531.1209 1540.2766 1596.9833 2953.4417 2989.9248 2998.6224 3039.8529 3070.6971 3112.1080 3157.7854 3174.4618 3183.3285 3220.2755 3480.1093 3537.0498 3547.5757
redmass: 6.9300 10.2546 7.4350 6.1389 6.8177 6.9624 5.5085 5.6615 4.8095 5.5155 5.7801 6.1763 6.5422 4.5189 3.4234 3.9713 1.9406 1.4557 2.3795 1.4871 4.3953 4.6475 5.7972 4.6673 1.1060 4.0043 5.9790 8.4592 3.2538 3.3348 5.8740 5.6232 1.4904 4.1200 4.1144 2.1996 1.7729 3.2631 1.3302 2.9298 2.2740 1.7856 3.5645 3.8563 2.7314 4.2622 3.8743 1.6012 1.8233 2.6041 1.6863 2.0910 1.2417 2.4965 1.9785 1.3222 1.3645 1.4066 1.4029 1.3492 1.4526 1.7851 1.2585 1.3783 1.2140 1.4844 1.3578 1.8348 2.3435 1.1412 2.3840 6.1110 11.6720 6.1869 1.0820 1.0668 1.0858 1.0853 1.0874 1.0991 1.0900 1.0949 1.0943 1.0961 1.0649 1.0657 1.0659
irintensity: 5.2357 2.0387 1.7642 0.9868 9.5331 2.1781 5.1881 8.5329 5.5400 6.7621 18.7643 11.8151 3.9752 19.7333 9.6006 8.5944 8.1459 59.2617 20.7358 73.7746 9.6029 9.3205 1.3272 7.0721 218.5662 30.2625 5.9111 12.1463 28.0609 41.1136 11.4082 8.1552 38.9945 31.5276 40.2691 6.5359 10.1517 8.6233 3.8707 51.8923 23.1206 6.0756 138.8201 127.8277 38.5454 29.4430 43.9199 37.0440 20.5546 29.0721 120.9145 54.6264 43.0369 25.9766 10.0856 58.4399 15.9430 2.7264 5.9064 3.3369 16.3188 8.7339 4.4480 4.5836 38.5317 2.7403 30.6975 1.6508 10.1019 17.6607 13.3131 0.3650 286.8083 34.1474 22.5754 29.7924 11.9890 16.1541 24.0675 8.1340 1.8409 5.2050 9.1618 2.7471 37.7633 8.0517 33.2997
temp: 298.150 k
press: 1.00000 atm
elementType: 8 8 8 8 8 8 7 6 6 6 6 6 6 6 6 6 6 6 1 1 1 1 1 1 1 1 1 1 1 1 1
symmnumber: 1
zpe: 616943.8 jmol-1
zpe.correction: 0.234982 hartree
zpe.thermalcorrener: 0.251551 hartree
zpe.thermalcorrenthalpy: 0.252495 hartree
zpe.thermalcorrgfe: 0.189911 hartree
zpe.sumelectzpe: -931.639909 hartree
zpe.sumelectthermal: -931.623340 hartree
zpe.sumelectthermalent: -931.622396 hartree
zpe.sumelectthermalfe: -931.684980 hartree
dipole: 13.9376 6.6415 -0.6431
dipole: 15.4525
quadrupole: -164.7575 -104.9949 -99.2041
quadrupole: -19.9651 13.6494 -1.1539
quadrupole: -41.7720 17.9906 23.7814 -19.9651 13.6494 -1.1539
hfenergy: -931.8748907 hartree
pointgroup: C01 [X(C11H13N1O6)]
dipole: -5.544913 2.4774864 0.2757693 debye
polarizability: 218.2237958|-21.5078242|143.6470747|3.9651011|24.2341715|108.5080801 unknown
InChI: InChI=1S/C11H13NO6/c13-7-5-18-10(9(15)8(7)14)12-3-1-2-6(4-12)11(16)17/h1-4,7-10,13-15H,5H2
charge 0 multiplicity 1
31 atoms
O  -1.766824 1.254316 -0.96782
O  -0.797374 -1.97778 0.540174
O  -3.739228 -1.956133 0.901226
O  -4.298604 0.773216 0.569533
O  3.73764 -1.569739 -1.287289
O  5.035339 -0.489586 0.368505
N  0.387109 0.564767 -0.240578
C  -1.640548 -0.812337 0.350956
C  -3.048617 -1.220398 -0.156007
C  -0.941797 0.078096 -0.702441
C  -3.872419 0.005203 -0.618661
C  -3.056799 0.864526 -1.595195
C  1.493458 -0.226175 -0.473798
C  0.488843 1.762059 0.447343
C  2.748736 0.138425 0.035122
C  1.728439 2.162569 0.957273
C  2.863141 1.328321 0.79211
C  3.97665 -0.736514 -0.318139
H  -1.74968 -0.233474 1.295879
H  -2.928666 -1.939236 -0.987888
H  -0.776825 -0.510336 -1.62843
H  -4.812471 -0.330203 -1.087992
H  -2.862162 0.321024 -2.541839
H  -3.562224 1.817848 -1.812038
H  -1.285957 -2.633548 1.102538
H  -4.19838 -1.279067 1.470813
H  1.392624 -1.13842 -1.067438
H  -0.422634 2.353572 0.527024
H  -3.576146 1.409167 0.813499
H  1.792156 3.115434 1.489914
H  3.846122 1.560202 1.215945
