program: Gaussian 09
title: 000192132
version: EM64L-G09RevD.01
frameworkgroup: C1[X(C14H24N2)]
method: RPBEPBE
basis: SDD
operation: Freq
keyword: #pfreq=noraman
keyword: PBEPBE/SDD
title: #p freq=noraman PBEPBE/SDD
converged: YES YES NO NO
title: Mulliken charges:
elementType: N N C C C C C C C C C C C C C C H H H H H H H H H H H H H H H H H H H H H H H H
charge: -0.100606 -0.571861 -0.061902 -0.343916 -0.573683 -0.412595 -0.728974 -0.332261 -0.641721 0.506276 -0.382220 -0.398425 -0.433684 -0.235087 -0.229636 -0.244699 0.220040 0.186854 0.205471 0.227517 0.202242 0.189912 0.194417 0.242331 0.213225 0.219858 0.208971 0.205171 0.227193 0.219959 0.187991 0.199890 0.171193 0.232304 0.231106 0.222296 0.222923 0.258650 0.268979 0.226500
chargesum: 0.00000
title: Mulliken charges with hydrogens summed into heavy atoms:
elementType: N N C C C C C C C C C C C C C C
charge: -0.100606 -0.044232 0.158138 0.048409 -0.143924 -0.028266 -0.053560 0.081881 -0.006578 0.506276 -0.011137 -0.166120 -0.202578 -0.012791 -0.006712 -0.018199
polarizability: 2.07998973e+02 1.03715843e+01 1.32629676e+02 -4.09514740e-01 -7.04071821e+00 1.48107708e+02
1716.lowfreq: -11.8980 -5.1643 -0.0006 0.0006 0.0007 5.9550 16.9940 18.6165 45.4489
frequency: 16.4293 18.2797 45.4263 52.8697 57.9803 78.1550 95.6732 130.2161 155.1721 188.1924 198.0505 211.9441 236.2774 240.0051 254.1394 277.4178 297.7664 351.1726 403.6283 404.9599 422.5555 429.5211 457.1156 525.9873 543.2780 602.3014 603.9312 618.2314 704.4453 717.1930 755.0925 771.9538 820.5193 834.8154 851.4190 854.4062 887.3513 892.3677 915.5569 940.4591 969.7660 974.8170 989.9797 992.0928 1016.0245 1026.8796 1039.9917 1047.1213 1057.3185 1083.3029 1092.5776 1096.9676 1109.5119 1122.1814 1134.3100 1165.0497 1170.9670 1186.4778 1189.9600 1213.3389 1215.6203 1237.0577 1259.9809 1277.3070 1283.6925 1292.7785 1306.6091 1311.7076 1331.8373 1348.9755 1361.5118 1363.7626 1377.3397 1382.2659 1387.5056 1431.9287 1439.3014 1457.6476 1466.3743 1468.5005 1468.9355 1474.7212 1477.6179 1478.3635 1483.6926 1490.9982 1494.5283 1591.8704 1613.6819 1635.0926 2851.0356 2852.8635 2859.8243 2968.0192 2973.7920 2976.7507 2977.4772 2986.2428 2997.5491 3007.6714 3019.3990 3033.7449 3046.9672 3049.6940 3070.3404 3074.9958 3079.8504 3111.8077 3114.7419 3130.0285 3141.2949 3160.4980 3448.2604 3576.3934
redmass: 3.7017 4.3664 3.2721 3.3198 1.8004 3.0943 3.1365 2.6013 3.1763 1.1971 1.2096 2.1511 1.5253 3.1650 1.7403 2.2870 2.5935 1.9753 2.3813 2.8054 3.1238 2.8301 2.7782 2.6370 3.4026 2.4636 1.5288 6.2609 2.0040 1.8201 1.6844 1.4509 3.0950 1.7007 1.7547 1.3915 1.4687 1.5657 1.4569 1.9325 1.8813 1.3892 6.0812 1.3173 2.0254 2.1866 1.6066 1.9988 2.1498 2.2097 1.7135 2.2680 1.4606 1.9615 1.8188 1.8522 1.0601 1.1148 1.6374 1.5637 2.3792 1.6459 1.3778 1.0801 1.3167 1.5051 1.2869 1.3444 1.2718 1.4606 1.3490 1.3203 1.2561 5.9893 1.4770 1.1604 2.1477 1.0599 1.1004 1.0782 1.0718 1.0641 1.0985 1.0803 2.1428 1.0532 1.0908 6.0190 6.1664 1.0946 1.0689 1.0713 1.0593 1.0601 1.0808 1.0558 1.0405 1.0622 1.0860 1.0968 1.0721 1.0911 1.1028 1.1012 1.0993 1.1001 1.0989 1.0868 1.0868 1.0908 1.0958 1.1014 1.0447 1.0974
irintensity: 0.0279 0.1027 0.1302 0.2336 4.7776 0.7358 0.2464 1.4166 0.8221 0.5474 1.3993 4.4548 25.9440 1.4350 33.8425 2.7742 0.5848 0.5991 5.6437 0.1017 18.3305 1.2154 5.5117 13.0853 3.5093 44.4037 185.4201 0.4259 46.4280 6.7393 44.3244 9.5026 3.0552 0.3191 0.8380 0.4855 0.3280 5.5212 1.2206 7.9797 3.5234 0.0692 0.0737 0.0617 12.3376 7.4340 2.7616 38.3307 12.0898 5.6454 12.7760 7.1263 15.7977 40.0187 34.4368 7.2097 0.4305 0.0551 34.2055 8.6714 0.9667 9.5588 3.2854 0.9290 9.4176 17.0214 4.3294 2.6830 2.4190 2.2012 4.0186 5.4711 31.8071 0.6335 20.5717 7.5460 7.2470 3.1644 9.1053 3.3637 2.3922 1.2719 19.0545 17.2215 15.1172 5.9954 9.2400 1.5873 12.3335 41.1755 51.4776 101.1013 188.2769 30.8394 4.5186 30.5197 42.9965 41.6665 47.0425 0.6518 40.6669 18.0733 13.9610 106.1934 39.5207 41.7675 41.8599 9.2496 7.5354 11.3721 46.5442 26.0637 2.5788 0.1393
temp: 298.150 k
press: 1.00000 atm
elementType: 7 7 6 6 6 6 6 6 6 6 6 6 6 6 6 6 1 1 1 1 1 1 1 1 1 1 1 1 1 1 1 1 1 1 1 1 1 1 1 1
symmnumber: 1
zpe: 928669.0 jmol-1
zpe.correction: 0.353711 hartree
zpe.thermalcorrener: 0.372055 hartree
zpe.thermalcorrenthalpy: 0.372999 hartree
zpe.thermalcorrgfe: 0.304662 hartree
zpe.sumelectzpe: -656.098976 hartree
zpe.sumelectthermal: -656.080632 hartree
zpe.sumelectthermalent: -656.079688 hartree
zpe.sumelectthermalfe: -656.148025 hartree
dipole: 0.6073 1.2905 0.9119
dipole: 1.6928
quadrupole: -90.4522 -104.2476 -93.5789
quadrupole: 1.5511 3.7829 -4.6160
quadrupole: 5.6407 -8.1547 2.5140 1.5511 3.7829 -4.6160
hfenergy: -656.4526871 hartree
pointgroup: C01 [X(C14H24N2)]
dipole: -0.2437749 -0.4359916 0.4404939 debye
polarizability: 207.9094674|10.5409322|135.7573299|-0.4717798|9.4992428|145.06956 unknown
InChI: InChI=1S/C14H24N2/c1-13(16(2)11-7-6-10-15)12-14-8-4-3-5-9-14/h3-5,8-9,13H,6-7,10-12,15H2,1-2H3
charge 0 multiplicity 1
40 atoms
N  -1.367786 -1.171975 0.675717
N  -5.027173 2.651278 -0.354015
C  0.120086 -1.124339 0.524094
C  -2.125852 -1.491634 -0.559813
C  0.542851 0.12443 -0.31203
C  -3.56615 -0.923958 -0.555936
C  0.759103 -2.429028 -0.026883
C  -3.61082 0.616745 -0.492838
C  -1.806468 -1.977908 1.832598
C  2.025917 0.446361 -0.196241
C  -5.044801 1.173744 -0.398557
C  2.546846 1.011656 0.998475
C  2.925635 0.18277 -1.260658
C  3.923276 1.300061 1.127624
C  4.304896 0.469587 -1.137872
C  4.809633 1.028514 0.058456
H  0.512626 -0.960986 1.54881
H  -2.174325 -2.596366 -0.736187
H  -1.586474 -1.054781 -1.420358
H  -0.067771 0.970487 0.056466
H  0.280984 -0.03223 -1.376086
H  -4.138671 -1.34916 0.2937
H  -4.075265 -1.276893 -1.476826
H  1.860719 -2.349997 -0.023453
H  0.43697 -2.623341 -1.067212
H  0.478743 -3.303187 0.589118
H  -3.018054 0.949083 0.383422
H  -3.125678 1.05069 -1.389309
H  -2.877968 -1.801323 2.032782
H  -1.244164 -1.672041 2.733086
H  -1.668962 -3.080235 1.695032
H  -5.615955 0.866624 -1.297127
H  -5.552086 0.699835 0.480296
H  1.863852 1.236714 1.827851
H  2.540087 -0.247198 -2.193648
H  4.304579 1.7412 2.055905
H  4.982535 0.260863 -1.973816
H  -4.471231 3.028481 0.420951
H  -5.951805 3.090022 -0.407716
H  5.877521 1.254735 0.155298
