program: Gaussian 09
title: 000192130
version: EM64L-G09RevD.01
frameworkgroup: C1[X(C10H14N4O5)]
method: RPBEPBE
basis: SDD
operation: Freq
keyword: #p
keyword: freq=noraman
keyword: PBEPBE/SDD
title: #p freq=noraman PBEPBE/SDD
converged: YES YES NO NO
title: Mulliken charges:
elementType: O O O O O N N N N C C C C C C C C C C H H H H H H H H H H H H H H
charge: -0.272291 -0.188021 -0.193347 -0.215370 -0.240472 -0.118713 -0.181189 0.055491 0.050170 -0.556809 0.274153 -0.348797 -0.387735 0.394778 0.334287 -0.309349 -0.304597 -0.654748 -0.648077 0.299651 0.296841 0.261004 0.210145 0.243103 0.229466 0.296520 0.298198 0.205769 0.255748 0.221355 0.219634 0.250114 0.223089
chargesum: 0.00000
title: Mulliken charges with hydrogens summed into heavy atoms:
elementType: O O O O O N N N N C C C C C C C C C C
charge: -0.272291 -0.188021 -0.193347 -0.215370 -0.240472 -0.118713 -0.181189 0.055491 0.050170 0.039682 0.274153 0.122353 0.084834 0.394778 0.334287 -0.012829 -0.006399 0.028124 0.044761
polarizability: 1.99139003e+02 -3.32614381e-01 2.08505128e+02 2.60480358e+01 -4.04062485e-01 1.10072181e+02
1716.lowfreq: -2.6534 -0.0006 0.0003 0.0006 3.1065 6.4194 23.1184 26.0701 40.0692
frequency: 23.0674 25.9785 40.0014 49.7419 61.3263 75.8632 93.4449 93.9037 104.8743 134.4917 169.2808 210.9905 219.8428 245.0717 256.5756 290.2696 306.4634 321.7435 339.3166 361.3736 374.0873 428.3187 458.5907 482.0955 500.6661 554.3657 574.7757 584.1819 614.1043 622.1834 680.7090 689.4465 712.3069 746.6615 762.8593 781.9946 782.6474 797.2279 811.7204 893.2062 899.7338 913.7510 941.2913 992.9781 1018.1870 1028.7437 1072.6316 1081.6555 1099.3176 1133.3155 1141.3492 1145.8298 1208.5225 1211.1678 1223.4816 1234.7798 1258.5339 1297.6993 1314.6105 1332.7880 1341.1620 1347.4828 1357.5200 1364.5066 1388.5133 1390.7245 1399.3994 1411.6739 1425.8254 1443.1680 1457.2833 1469.2072 1471.3846 1473.2630 1481.8183 1484.4548 1497.9911 1503.4143 1605.7913 2986.7298 2988.2603 3008.1710 3012.1322 3056.2517 3060.5984 3071.3878 3087.3339 3088.2351 3095.3912 3104.8766 3134.6171 3246.4717 3263.5634
redmass: 4.2542 4.8600 5.3854 7.2538 5.3592 8.9873 3.0567 7.7364 5.4092 3.4991 4.2111 1.8712 1.0501 6.8377 1.8914 8.1830 3.6400 4.0834 9.2777 3.5722 2.4691 2.9085 5.4467 7.1792 3.7471 3.6092 4.1985 4.1488 6.3676 5.3716 8.7037 5.3192 6.0616 5.4059 8.5909 1.3526 1.6146 1.6146 1.9191 2.9547 3.0321 1.3656 2.1481 2.7125 2.6326 1.3427 2.0940 1.8596 1.7614 5.4631 2.0982 2.1067 3.0451 3.9665 6.3781 1.5360 1.4410 1.3078 1.6113 5.3280 1.2922 9.6775 1.2890 6.9235 1.2716 2.0721 1.2711 2.1490 2.6650 4.1992 1.1096 1.3204 1.2677 1.1649 1.0549 1.0682 5.2079 1.1317 6.7811 1.0360 1.0357 1.0623 1.0624 1.0727 1.0880 1.1000 1.0992 1.0994 1.1020 1.1022 1.1012 1.0938 1.1058
irintensity: 0.9001 0.9463 2.0841 0.4113 1.4496 6.9794 0.3639 1.1759 0.7789 0.4063 5.1584 6.8203 0.0633 0.8118 1.2249 1.2673 0.6107 0.5222 4.1985 9.8441 9.0850 5.7944 1.0238 6.9151 1.9545 3.6764 0.5807 3.5896 2.0415 7.8308 2.7227 19.7499 1.0858 4.4982 34.8217 13.0980 13.5253 10.9864 53.6647 8.8242 5.7651 0.5087 9.2256 1.4373 4.8034 8.3095 13.1968 10.2686 18.0426 48.8750 21.0974 48.0603 109.3708 537.2750 11.7327 30.6931 82.0818 19.0890 55.2199 181.1967 3.6051 77.0209 3.6871 167.6334 34.0511 13.0244 42.8949 95.5497 28.0131 3.5480 20.1870 8.7988 26.9758 1.1725 10.9546 9.4124 23.1816 2.9719 272.9798 25.0007 19.1041 33.2829 27.4759 22.2205 0.8095 9.2595 36.9103 30.8354 30.1914 28.6826 12.7886 3.8639 7.4504
temp: 298.150 k
press: 1.00000 atm
elementType: 8 8 8 8 8 7 7 7 7 6 6 6 6 6 6 6 6 6 6 1 1 1 1 1 1 1 1 1 1 1 1 1 1
symmnumber: 1
zpe: 654026.8 jmol-1
zpe.correction: 0.249106 hartree
zpe.thermalcorrener: 0.268213 hartree
zpe.thermalcorrenthalpy: 0.269158 hartree
zpe.thermalcorrgfe: 0.199072 hartree
zpe.sumelectzpe: -982.971707 hartree
zpe.sumelectthermal: -982.952599 hartree
zpe.sumelectthermalent: -982.951655 hartree
zpe.sumelectthermalfe: -983.021740 hartree
dipole: 3.0284 1.4682 1.4808
dipole: 3.6769
quadrupole: -88.4505 -139.1255 -111.5831
quadrupole: 7.3474 1.7028 3.2965
quadrupole: 24.6025 -26.0725 1.4699 7.3474 1.7028 3.2965
hfenergy: -983.2208125 hartree
pointgroup: C01 [X(C10H14N4O5)]
dipole: 1.2247211 -0.3413722 -0.6900454 debye
polarizability: 198.8258999|5.9431358|204.0334329|-25.8131721|20.5836938|114.8569798 unknown
InChI: InChI=1S/C10H14N4O5/c1-3-11(4-2)10(15)7-12-8(13(16)17)5-6-9(12)14(18)19/h5-6H,3-4,7H2,1-2H3
charge 0 multiplicity 1
33 atoms
O  0.764132 0.668074 1.381679
O  -2.048849 3.356037 0.651204
O  -2.415569 -3.364796 -0.148999
O  -0.397773 2.804692 -0.830651
O  -0.499065 -2.71753 -1.212849
N  2.560909 0.022091 0.044389
N  -1.123418 0.03262 -0.485906
N  -1.383787 2.49657 -0.045486
N  -1.582305 -2.45502 -0.536336
C  0.276613 0.050341 -0.949148
C  1.225116 0.267226 0.266975
C  3.51215 0.247337 1.165527
C  3.119731 -0.466173 -1.240537
C  -1.81929 1.121012 0.044465
C  -1.907858 -1.094425 -0.19216
C  -3.035908 0.699619 0.621532
C  -3.093297 -0.702191 0.469249
C  4.078437 1.68214 1.171228
C  3.231995 -2.005939 -1.307225
H  0.400155 0.889194 -1.651278
H  0.464267 -0.905818 -1.453033
H  2.970812 0.05487 2.106765
H  4.324375 -0.497328 1.072845
H  2.511449 -0.087334 -2.080101
H  4.119863 -0.008792 -1.357862
H  -3.766219 1.360204 1.08055
H  -3.881396 -1.383396 0.778315
H  4.613245 1.913043 0.231627
H  3.262813 2.413531 1.298925
H  4.789506 1.806928 2.008031
H  3.856648 -2.391958 -0.481999
H  2.24104 -2.48798 -1.2376
H  3.699076 -2.312948 -2.260738
