program: Gaussian 09
title: 000192125
version: EM64L-G09RevD.01
frameworkgroup: C1[X(C24H27I2NO3)]
method: RPBEPBE
basis: SDD
operation: Freq
keyword: #p
keyword: freq=noraman
keyword: PBEPBE/SDD
title: #p freq=noraman PBEPBE/SDD
converged: YES YES NO NO
title: Mulliken charges:
elementType: I I O O O N C C C C C C C C C C C C C C C C C C C C C C C C H H H H H H H H H H H H H H H H H H H H H H H H H H H
charge: 0.121204 0.122230 -0.245752 -0.266774 -0.230845 -0.078464 -0.505809 0.244725 0.048574 -0.354295 0.157337 0.139482 -0.344579 -0.023472 -0.348577 0.343300 -0.382844 -0.331853 -0.363275 -0.698104 -0.311918 -0.250984 -0.223034 -0.311444 -0.311149 0.589326 -0.522969 -0.511053 -0.613825 -0.626048 0.221299 0.246629 0.204164 0.235748 0.193557 0.205255 0.258977 0.234522 0.230889 0.208905 0.175026 0.256131 0.226632 0.208068 0.210452 0.217018 0.216860 0.230770 0.233108 0.290803 0.300466 0.225738 0.223951 0.186762 0.221528 0.185526 0.242104
chargesum: 0.00000
title: Mulliken charges with hydrogens summed into heavy atoms:
elementType: I I O O O N C C C C C C C C C C C C C C C C C C C C C C C C
charge: 0.121204 0.122230 -0.245752 -0.266774 -0.230845 -0.078464 -0.037882 0.244725 0.048574 0.085618 0.157337 0.139482 0.054233 -0.023472 -0.089600 0.343300 0.082567 0.052078 -0.107143 -0.053774 0.122782 -0.020214 0.010075 -0.020641 -0.010683 0.589326 -0.522969 -0.511053 0.022626 0.023109
polarizability: 4.20702101e+02 -1.25409578e+01 3.75752968e+02 -3.82811587e+01 -5.98870221e+00 2.50710084e+02
1716.lowfreq: -16.6023 -4.0307 -0.0004 0.0001 0.0004 2.8417 5.4328 13.1348 16.2806
frequency: -16.0038 12.8784 16.1379 19.9965 24.8553 30.9859 39.0521 45.5357 51.3688 59.0361 68.4029 84.8368 96.0654 100.9750 104.9203 110.9692 123.4707 145.7836 152.6149 169.1124 170.0828 193.0944 210.3552 221.2272 228.0006 238.3246 241.3362 244.7601 263.1008 271.6877 296.3825 305.5990 314.8971 325.0583 334.5586 371.6386 381.4501 403.5142 442.2213 445.1185 451.4940 486.1857 494.6497 501.7043 526.7103 556.2700 564.3723 600.0368 617.1498 648.2351 652.6373 681.6108 702.3014 731.3399 732.3911 743.6517 756.9608 773.9731 778.5719 781.1497 785.6361 813.6948 832.3297 860.5238 869.7593 892.0428 898.4674 909.1776 914.3980 920.6619 928.5324 943.2597 944.3437 982.4226 1003.0744 1016.2988 1019.2399 1027.5948 1032.5734 1055.1314 1059.0287 1065.5207 1066.5112 1089.6460 1091.8573 1101.7514 1103.7012 1133.3468 1145.1090 1160.4378 1167.1675 1179.6850 1193.1491 1201.0671 1217.8106 1226.6657 1234.4676 1242.3572 1257.5550 1260.5480 1278.1257 1287.1259 1287.7294 1288.0872 1300.2318 1300.8915 1316.4914 1329.7994 1344.9924 1354.7870 1369.9241 1372.6109 1377.6824 1391.8840 1407.9086 1418.0162 1420.9044 1438.0127 1440.8160 1441.5167 1461.0599 1462.0159 1464.7171 1465.3396 1472.5839 1474.3653 1476.0600 1477.3203 1478.1544 1484.2160 1485.8303 1490.3863 1504.5326 1531.0736 1561.5487 1572.5536 1588.7125 1625.7579 2816.5338 2843.1942 2859.8597 2966.0228 2974.6321 2986.0926 2997.9874 2998.2795 3001.1264 3008.7712 3012.8818 3019.6670 3031.5691 3050.1011 3065.9993 3070.0089 3073.8282 3078.6045 3078.9256 3088.2982 3095.2623 3139.1988 3155.0892 3168.8041 3169.6984 3172.1539 3179.1006
redmass: 3.4070 5.0319 5.8447 4.0530 3.9204 6.9121 5.8780 7.1391 1.9031 3.0843 2.6415 9.2231 8.2908 5.8098 2.5700 2.8005 3.1657 4.2262 4.9870 4.1692 4.9847 4.8985 5.5042 1.1928 1.1679 1.3402 3.2898 4.6629 3.1429 4.7619 5.2182 3.4222 4.9766 4.8709 2.4739 4.8508 5.2037 3.3585 5.4142 3.1025 2.8899 4.4353 4.3418 4.9891 6.1136 4.2420 4.2095 5.5739 6.7228 7.3454 5.6089 8.8822 5.9635 1.1492 4.6818 4.6209 1.3744 2.6503 4.0787 1.4995 1.4378 4.3210 5.4276 1.3677 1.2844 2.6942 1.9365 1.5196 2.0062 1.7646 6.1638 1.4608 2.6176 1.3044 4.3894 2.0265 2.6846 3.7730 1.5988 2.2997 3.2753 2.6204 2.1784 2.6279 1.3593 1.5266 2.1196 2.2575 1.6363 1.9531 1.2021 1.5493 1.8531 1.8226 2.5380 1.6139 2.8862 1.8481 1.3431 2.3396 1.2139 1.2340 1.3802 1.2775 1.3040 1.3140 1.3975 3.8278 1.5649 3.1728 1.5744 3.3217 1.3849 1.2122 5.0195 1.1545 3.0936 2.1250 1.4513 1.1749 1.0596 1.0588 1.0883 2.7975 1.1063 1.0670 1.0652 1.0445 1.0596 1.0676 1.0765 1.0877 8.1728 8.4605 8.5124 7.2089 7.0332 7.9846 1.0702 1.0574 1.0574 1.0586 1.0367 1.0603 1.0620 1.0840 1.0610 1.0624 1.0982 1.0722 1.0718 1.1002 1.1005 1.1005 1.0998 1.1011 1.1029 1.1006 1.1052 1.0860 1.0906 1.0934 1.0938 1.0931 1.0994
irintensity: 0.0976 0.2242 0.1544 0.3767 0.1606 0.7673 0.1750 0.0803 0.1467 0.1993 0.1654 0.3662 0.2330 2.7127 1.8154 0.9088 0.5410 0.9892 0.6665 0.5224 1.4904 1.6509 2.6670 0.1224 0.8867 0.2820 0.6884 2.2488 2.4947 6.8116 0.3320 17.9492 5.1443 3.5835 7.5597 1.4334 2.6202 4.5987 11.9472 4.0554 1.2497 4.6282 7.9334 4.7032 11.3414 6.2846 1.7423 1.4889 22.0143 10.6216 18.4280 69.4185 4.1415 17.2700 14.3797 5.8350 78.2740 25.6574 16.2834 11.4457 8.5295 26.2655 7.7398 1.2518 1.8283 47.3154 7.4963 6.2407 2.7456 39.7378 172.8123 0.5994 6.6146 0.1546 15.3662 17.5277 14.1017 4.0423 16.9880 14.6212 16.6483 12.6655 25.6238 26.1780 4.6333 20.5314 36.4818 27.4167 15.9228 64.6643 12.6510 10.8101 6.7558 15.4067 83.2740 20.4070 217.8919 108.4346 18.4997 2.0334 1.0227 37.3350 23.4863 20.0910 28.2821 22.6262 8.5623 13.6485 6.8684 150.7464 2.0839 45.9590 18.3929 11.7704 10.9184 3.3005 26.8438 24.4912 46.6599 2.1621 8.0027 15.1566 1.9368 28.1296 3.8711 6.6424 4.3075 11.2957 9.4879 12.8628 15.4609 20.5169 166.0839 42.7542 376.1337 16.8822 6.0826 0.4369 74.6523 67.1422 247.3717 32.1455 38.3031 21.1510 30.3321 17.1717 3.2377 65.8700 9.7723 40.0360 37.5973 3.9391 9.4942 31.9199 41.0942 28.5268 73.1422 44.1847 29.2515 1.6519 12.8857 9.9609 4.2099 2.0893 11.9817
temp: 298.150 k
press: 1.00000 atm
elementType: 53 53 8 8 8 7 6 6 6 6 6 6 6 6 6 6 6 6 6 6 6 6 6 6 6 6 6 6 6 6 1 1 1 1 1 1 1 1 1 1 1 1 1 1 1 1 1 1 1 1 1 1 1 1 1 1 1
symmnumber: 1
zpe: 1186293.6 jmol-1
zpe.correction: 0.451835 hartree
zpe.thermalcorrener: 0.482926 hartree
zpe.thermalcorrenthalpy: 0.483870 hartree
zpe.thermalcorrgfe: 0.383126 hartree
zpe.sumelectzpe: -1231.938442 hartree
zpe.sumelectthermal: -1231.907351 hartree
zpe.sumelectthermalent: -1231.906407 hartree
zpe.sumelectthermalfe: -1232.007151 hartree
dipole: 1.2364 1.3790 1.2662
dipole: 2.2436
quadrupole: -179.4019 -204.0942 -205.0646
quadrupole: -8.9842 4.6014 -0.7597
quadrupole: 16.7850 -7.9073 -8.8777 -8.9842 4.6014 -0.7597
hfenergy: -1232.390277 hartree
pointgroup: C01 [X(C24H27I2N1O3)]
dipole: 0.5719552 -0.1494374 -0.6555034 debye
polarizability: 407.4890389|-22.6039305|337.3512193|55.1661333|54.7324745|302.3248948 unknown
InChI: InChI=1S/C24H27I2NO3/c1-4-5-10-21-22(17-9-6-7-11-20(17)30-21)23(28)16-14-18(25)24(19(26)15-16)29-13-8-12-27(2)3/h6-7,9,11,14-15H,4-5,8,10,12-13H2,1-3H3
charge 0 multiplicity 1
57 atoms
I  2.693915 -3.206325 -1.099835
I  2.758444 -0.102968 4.286095
O  -4.340518 -0.955679 -1.432662
O  3.798523 -1.985827 1.666109
O  -1.774421 1.212188 1.231852
N  6.569362 1.401959 -0.843275
C  -3.849905 1.415938 -1.003858
C  -3.50296 -0.018899 -0.792361
C  -2.499543 -0.670798 -0.064192
C  -4.939412 1.919243 -0.00898
C  -2.730476 -2.114859 -0.220197
C  -3.870457 -2.240966 -1.063383
C  -5.302251 3.399753 -0.257675
C  -1.503432 0.063213 0.744752
C  -2.149276 -3.303872 0.291455
C  -0.138478 -0.522985 0.984877
C  5.155026 -0.340911 0.305783
C  6.488261 0.440608 0.280986
C  -4.446327 -3.455596 -1.452663
C  -6.381972 3.911874 0.719685
C  5.00747 -1.099948 1.631178
C  -2.7104 -4.54486 -0.079636
C  -3.837904 -4.625586 -0.943404
C  0.567991 -0.114731 2.143769
C  0.483457 -1.408262 0.069074
C  2.536401 -1.441844 1.455839
C  1.798741 -1.848045 0.30326
C  1.867574 -0.590167 2.386988
C  7.711054 2.32756 -0.68883
C  6.567154 0.752661 -2.170368
H  -4.209311 1.552671 -2.041955
H  -2.941211 2.025928 -0.858957
H  -5.845899 1.289848 -0.1058
H  -4.554839 1.795776 1.020732
H  -5.656481 3.523405 -1.301758
H  -4.388036 4.018978 -0.158765
H  -1.286243 -3.27006 0.962244
H  5.103089 -1.062192 -0.528905
H  4.329585 0.385381 0.182252
H  6.580102 1.024983 1.218555
H  7.343674 -0.288289 0.267053
H  -5.321686 -3.490124 -2.10681
H  5.826982 -1.822437 1.782681
H  4.979978 -0.402642 2.489461
H  -7.316004 3.327005 0.622028
H  -6.626189 4.97324 0.530207
H  -6.039195 3.825258 1.767619
H  -2.267456 -5.468528 0.307781
H  -4.245187 -5.60572 -1.212323
H  0.07166 0.5662 2.840727
H  -0.04703 -1.726376 -0.831745
H  7.63192 2.85948 0.276162
H  7.688068 3.080968 -1.496253
H  8.708044 1.817237 -0.722939
H  6.60704 1.528077 -2.955789
H  7.435039 0.059767 -2.322743
H  5.637844 0.177195 -2.31654
