program: Gaussian 09
title: 000192124
version: EM64L-G09RevD.01
frameworkgroup: C1[X(C16H21NO)]
method: RPBEPBE
basis: SDD
operation: Freq
keyword: #p
keyword: freq=noraman
keyword: PBEPBE/SDD
title: #p freq=noraman PBEPBE/SDD
converged: YES YES NO NO
title: Mulliken charges:
elementType: O N C C C C C C C C C C C C C C C C H H H H H H H H H H H H H H H H H H H H H
charge: -0.469388 -0.361235 0.126355 -0.484372 -0.486537 -0.446256 -0.446720 0.324616 -0.506537 0.284125 0.121301 -0.180782 -0.451132 -0.421221 -0.443044 -0.251260 -0.247456 -0.616027 0.246254 0.211169 0.211366 0.240603 0.232882 0.207592 0.207337 0.230401 0.294529 0.195661 0.239659 0.230109 0.239311 0.222600 0.221275 0.220781 0.361423 0.274581 0.227332 0.235458 0.205245
chargesum: 0.00000
title: Mulliken charges with hydrogens summed into heavy atoms:
elementType: O N C C C C C C C C C C C C C C C C
charge: -0.107965 -0.086653 0.126355 -0.026949 -0.034568 -0.005781 -0.008981 0.324616 -0.212008 0.284125 0.121301 0.014879 -0.211473 -0.191112 0.018867 -0.029984 -0.026675 0.052008
polarizability: 2.08778484e+02 6.85267140e+00 2.11574657e+02 -7.41758358e+00 1.58864687e+00 1.20919395e+02
1716.lowfreq: -13.6330 -6.8316 -0.0003 -0.0002 0.0006 7.0831 24.5218 51.5575 66.9096
frequency: 24.1177 51.3523 66.8519 73.1995 83.6678 95.9194 114.7312 125.8216 148.1741 172.8571 223.7917 242.2089 266.9008 274.1269 318.7166 343.1441 356.8993 413.5293 426.5851 500.2831 536.6555 549.0773 575.2956 606.7480 630.3175 638.9034 641.8636 667.2120 732.1710 752.7495 769.4040 773.3167 793.1411 809.9665 813.3456 860.0088 867.4749 871.0064 881.5781 922.4793 933.9092 945.5754 956.4272 970.9120 977.3530 1004.1884 1012.1457 1022.7267 1027.5219 1033.2903 1063.3957 1080.6054 1084.5704 1103.2488 1113.0161 1125.2665 1149.8030 1154.1921 1169.6437 1178.4860 1187.5216 1220.6622 1221.4750 1235.7978 1253.8258 1266.2466 1272.1807 1279.1956 1291.3573 1299.9815 1300.8403 1309.4834 1323.8771 1334.6741 1395.0607 1408.4579 1433.0622 1442.0768 1445.9708 1459.8139 1462.8228 1465.9739 1469.8352 1469.9743 1471.1849 1489.2329 1491.9646 1584.5764 1614.0196 1623.6975 2875.2649 2914.2027 2943.2880 2987.3823 2993.3990 2998.6123 3014.3346 3032.2791 3043.8738 3049.0701 3061.5545 3068.5926 3082.3550 3085.6167 3113.2476 3119.1884 3135.0161 3156.3042 3193.9035 3261.9585 3437.4875
redmass: 3.6027 3.4647 2.2954 2.1485 3.5371 3.2048 2.6990 2.5760 3.8096 1.9563 1.8280 2.8716 3.2599 3.6036 5.4471 2.9250 2.7521 4.3119 2.7617 3.2091 3.4957 3.3423 5.3323 3.2204 2.6044 1.7971 3.1026 1.8276 2.8607 1.4452 2.4169 1.8453 1.6447 1.6269 2.2101 1.9429 1.8210 1.4449 2.6027 1.9334 1.4693 2.5757 2.1489 3.7921 1.3180 1.9502 2.3867 1.7741 2.7472 1.5971 2.7694 4.0830 2.4653 1.4566 1.9564 1.8378 2.5988 1.6519 1.1225 1.2846 1.3585 1.3270 1.4712 1.4377 1.3581 1.7967 1.2657 1.4926 1.3139 1.3725 1.4456 1.5213 1.3327 1.7714 3.6442 2.0493 1.1435 1.2449 2.3694 1.0831 3.2874 1.1013 1.0907 1.0654 1.0807 1.0973 1.0422 6.4209 7.1171 8.2979 1.0815 1.0506 1.0661 1.0621 1.0621 1.0609 1.0648 1.0813 1.1014 1.0954 1.1006 1.1024 1.1047 1.1009 1.0856 1.0890 1.0935 1.0999 1.0951 1.0634 1.0743
irintensity: 2.5623 0.8917 1.6355 2.2388 0.5066 0.2673 0.4587 0.2232 0.1912 2.2397 2.9240 1.5449 6.0498 1.8951 4.7145 5.5839 1.6220 0.8987 5.0026 2.4915 3.5387 1.9707 1.1095 4.0712 0.5947 35.8339 2.1204 21.8626 4.1565 52.7898 22.4061 149.3761 32.1858 0.3135 2.2932 14.3114 17.3396 16.5202 1.5258 16.6517 4.5119 2.4784 3.9540 2.1796 0.0687 19.8026 22.1162 2.7362 25.9534 2.7393 8.6164 0.9043 3.9119 6.6266 12.0292 40.7701 32.4158 5.0838 1.8410 4.3403 1.1180 1.5217 3.0889 23.1175 11.0011 3.1156 0.1040 1.6772 7.1188 1.7781 1.9531 0.1677 32.3024 31.3622 13.3501 28.6981 1.2303 8.0554 9.8209 4.4550 25.9105 16.0245 3.8820 21.2194 6.4769 6.2299 15.8786 0.2703 3.1690 2.6276 57.7568 122.1206 60.5169 14.0745 30.6411 41.9098 65.3285 39.7988 13.5898 16.4988 5.1085 20.3647 80.0389 32.7035 11.9937 5.2967 39.7157 36.8964 0.3554 155.3670 0.0105
temp: 298.150 k
press: 1.00000 atm
elementType: 8 7 6 6 6 6 6 6 6 6 6 6 6 6 6 6 6 6 1 1 1 1 1 1 1 1 1 1 1 1 1 1 1 1 1 1 1 1 1
symmnumber: 1
zpe: 874551.8 jmol-1
zpe.correction: 0.333099 hartree
zpe.thermalcorrener: 0.350300 hartree
zpe.thermalcorrenthalpy: 0.351244 hartree
zpe.thermalcorrgfe: 0.287087 hartree
zpe.sumelectzpe: -750.906151 hartree
zpe.sumelectthermal: -750.888950 hartree
zpe.sumelectthermalent: -750.888006 hartree
zpe.sumelectthermalfe: -750.952164 hartree
dipole: 1.8962 1.1703 1.7821
dipole: 2.8532
quadrupole: -84.4229 -107.1415 -113.0155
quadrupole: 5.4369 1.3363 -4.1738
quadrupole: 17.1037 -5.6149 -11.4889 5.4369 1.3363 -4.1738
hfenergy: -751.2392505 hartree
pointgroup: C01 [X(C16H21N1O1)]
dipole: -0.7478788 0.4269104 -0.7200986 debye
polarizability: 209.216775|-7.0435711|211.1396371|-6.2537943|-4.06447|120.916124 unknown
InChI: InChI=1S/C16H21NO/c1-17-11-15(18)13-10-16(8-4-5-9-16)14-7-3-2-6-12(13)14/h2-3,6-7,10,15,17-18H,4-5,8-9,11H2,1H3
charge 0 multiplicity 1
39 atoms
O  -2.333588 -1.704124 1.236894
N  -4.388666 -0.562978 -0.087152
C  1.67116 -0.572611 -0.059844
C  2.782259 -0.989958 0.962728
C  2.241729 -1.18834 -1.3825
C  3.173091 -2.440568 0.559093
C  2.818753 -2.570611 -0.963268
C  1.382224 0.924839 -0.116618
C  0.300742 -1.14293 0.305533
C  -0.637977 -0.153754 0.436619
C  0.005449 1.157825 0.187548
C  -2.093914 -0.338439 0.776204
C  2.241397 1.998615 -0.398184
C  -0.509205 2.473918 0.218847
C  -3.028726 -0.086981 -0.448949
C  1.725126 3.321442 -0.371477
C  0.362947 3.554339 -0.062768
C  -5.273716 -0.902125 -1.223127
H  2.435751 -0.909108 2.007372
H  3.646307 -0.308381 0.841779
H  3.048303 -0.529332 -1.758283
H  1.474709 -1.259795 -2.173314
H  2.596743 -3.173335 1.152067
H  4.24227 -2.63725 0.755487
H  3.698867 -2.840778 -1.574057
H  2.065178 -3.36417 -1.115821
H  0.099542 -2.203994 0.463179
H  -2.374297 0.384846 1.581072
H  3.299423 1.829113 -0.632857
H  -1.56032 2.668546 0.463123
H  -2.670027 -0.707286 -1.290624
H  -2.99091 0.977358 -0.768494
H  2.384913 4.169409 -0.58772
H  -0.017862 4.582052 -0.040725
H  -3.306945 -1.847214 1.01336
H  -4.84793 0.075408 0.577755
H  -6.24696 -1.256131 -0.840134
H  -4.820463 -1.724657 -1.804272
H  -5.461082 -0.054461 -1.921267
