program: Gaussian 09
title: 000192119
version: EM64L-G09RevD.01
frameworkgroup: C1[X(C7H13NO5)]
method: RPBEPBE
basis: SDD
operation: Freq
keyword: #p
keyword: freq=noraman
keyword: PBEPBE/SDD
title: #p freq=noraman PBEPBE/SDD
converged: YES YES NO NO
title: Mulliken charges:
elementType: O O O O O N C C C C C C C H H H H H H H H H H H H H
charge: -0.459662 -0.413150 -0.399729 -0.233204 -0.247092 -0.573633 -0.364513 -0.412699 -0.383310 -0.177649 -0.145856 0.136873 0.133902 0.247482 0.212802 0.204973 0.227812 0.219923 0.229864 0.249336 0.256728 0.282197 0.280357 0.362174 0.378568 0.387507
chargesum: 0.00000
title: Mulliken charges with hydrogens summed into heavy atoms:
elementType: O O O O O N C C C C C C C
charge: -0.097488 -0.034582 -0.012222 -0.233204 -0.247092 -0.011079 0.095771 0.020086 0.066477 0.071686 0.110872 0.136873 0.133902
polarizability: 1.09721246e+02 4.75388657e+00 9.79608495e+01 5.11275842e+00 -2.12540949e+00 8.78072458e+01
1716.lowfreq: -5.4253 -3.3409 -0.0006 -0.0005 0.0004 6.4438 24.1963 32.6662 41.8576
frequency: 24.0321 32.4131 41.8526 50.3182 82.3779 92.5762 119.2284 140.8114 211.6819 226.5238 257.1360 288.7061 300.6713 303.4450 354.9287 369.4556 436.8324 491.9150 498.9744 574.9811 596.6510 606.0622 630.1983 688.3524 702.3637 726.6702 746.6131 801.3327 832.5249 854.6783 923.1946 959.6057 999.7450 1034.0930 1034.4980 1062.7767 1072.7488 1085.8885 1138.4626 1147.8663 1207.4950 1218.6631 1239.6505 1245.4339 1282.4355 1286.7450 1288.6435 1300.4716 1304.7200 1339.3767 1361.4326 1364.5197 1391.2992 1448.5355 1458.9329 1481.5564 1640.4924 1652.1385 1653.6407 2972.1495 2982.2634 2991.5968 3008.5809 3025.4431 3036.1833 3048.8376 3066.5510 3443.7661 3480.5368 3499.2481 3514.3259 3566.6159
redmass: 6.6039 6.6701 6.2246 9.3107 4.1884 5.1364 2.2201 3.9521 1.2363 3.1491 3.4964 3.5409 3.1262 2.4941 1.4726 3.2198 4.3057 2.9748 2.9646 2.6374 1.7521 2.1690 1.6126 1.7678 3.4203 4.1614 1.1643 3.2320 1.7348 3.8997 2.9316 2.4574 2.9423 1.6705 2.5887 2.5622 2.1821 2.7874 2.4983 1.4327 1.2934 1.3849 1.3968 1.4321 1.5866 1.6891 1.2879 1.1717 1.3521 1.3353 1.5052 1.3954 1.6350 1.1021 1.0757 1.0923 8.7938 1.3767 3.2654 1.0612 1.0596 1.0621 1.0803 1.0947 1.0911 1.1000 1.1042 1.0454 1.0653 1.0641 1.0642 1.0964
irintensity: 1.7905 2.0002 0.2341 1.9642 2.7978 1.3782 0.2572 2.3142 33.6796 9.0944 9.3414 8.6769 8.3034 76.1731 83.8308 15.5075 17.8093 9.1465 13.9308 55.8410 84.5712 64.9384 106.5838 236.3824 44.8381 25.0509 17.7911 10.9116 8.3314 18.4859 7.1244 3.3043 83.7788 16.5719 357.6181 94.7138 34.7525 5.1453 19.7803 3.5777 17.5741 11.8995 15.1552 2.8990 15.1314 84.5614 6.4652 0.1909 6.0368 2.1075 6.6907 4.3903 7.5463 5.2988 5.7867 8.1893 208.7542 8.2687 260.5572 7.6903 9.0527 31.4850 42.9173 5.1347 6.5772 6.7324 60.7371 1.2841 32.0166 12.5476 31.0568 4.3606
temp: 298.150 k
press: 1.00000 atm
elementType: 8 8 8 8 8 7 6 6 6 6 6 6 6 1 1 1 1 1 1 1 1 1 1 1 1 1
symmnumber: 1
zpe: 540385.9 jmol-1
zpe.correction: 0.205822 hartree
zpe.thermalcorrener: 0.220987 hartree
zpe.thermalcorrenthalpy: 0.221931 hartree
zpe.thermalcorrgfe: 0.161007 hartree
zpe.sumelectzpe: -704.375334 hartree
zpe.sumelectthermal: -704.360170 hartree
zpe.sumelectthermalent: -704.359226 hartree
zpe.sumelectthermalfe: -704.420149 hartree
dipole: -0.7835 1.3048 -0.6792
dipole: 1.6666
quadrupole: -77.6367 -76.0012 -77.8724
quadrupole: 12.7475 -9.0862 2.2825
quadrupole: -0.4666 1.1689 -0.7023 12.7475 -9.0862 2.2825
hfenergy: -704.5811564 hartree
pointgroup: C01 [X(C7H13N1O5)]
dipole: 0.3027537 0.4970326 0.3020593 debye
dipolederiv: -0.6584084 -0.0775641 -0.0513304 -0.1165381 -0.4451262 -0.2495717 -0.1072836 -0.1969089 -0.5355334 -0.4613993 0.3287823 0.1811663 0.2860859 -1.0550818 -0.2522357 0.1510509 -0.2052749 -0.4314257 -0.4367973 0.0530754 0.1176488 0.1004799 -0.7130641 -0.5247086 0.12759 -0.4439886 -0.7273587 -0.7968584 -0.1851684 -0.2380872 0.0084686 -0.6885105 -0.1717881 -0.2440876 -0.2899341 -0.4944186 -0.4010231 0.0716144 -0.1526019 0.196273 -0.586954 0.1493246 -0.1545611 -0.1008917 -0.9222597 -0.6939164 0.1506993 -0.0693573 0.1063355 -0.6057643 0.1063617 -0.0242429 0.0583451 -0.1951233 -0.0600744 0.0039718 -0.0071718 -0.1062017 0.0847507 0.0567428 0.0582223 0.0678225 0.0274364 0.0200588 -0.0219555 0.00667 0.0777064 0.0989198 0.0463967 -0.0789579 0.0804798 0.0973667 0.0098875 -0.1081425 -0.0222259 0.0373013 0.0798634 0.021478 -0.0495224 -0.0621592 0.0918023 -0.0162604 -0.0081678 -0.0188898 -0.1318782 0.514029 -0.1122778 0.0015114 -0.0593246 0.1903604 0.3027879 0.1688137 -0.0030488 0.1928524 0.1241414 0.2122187 0.0147941 0.3318186 0.4061127 1.1079675 -0.1020824 0.2249379 -0.3032437 1.1812181 0.4963632 0.3286457 0.5713003 0.4585103 0.3694157 -0.219003 0.1187257 -0.4689645 1.0218394 0.1449792 0.1326548 0.2740986 1.3117977 0.0821805 0.0615526 -0.0105189 0.1091418 -0.0716029 0.0447499 -0.0200706 0.0310392 0.0439665 0.0671791 -0.0031385 -0.0042462 0.0073937 0.0316398 -0.082235 0.0029224 -0.0760853 -0.0972831 0.0212205 -0.0265523 -0.001409 -0.019058 0.0280393 -0.100578 -0.016748 -0.0687174 -0.1130984 0.0416825 0.0347511 -0.0013455 0.0605386 -0.1226779 0.0524238 -0.0235512 0.0210995 0.0664565 0.0465505 -0.0200358 -0.0046721 -0.0108409 0.0239927 -0.1168374 0.0184321 -0.0746513 -0.0828536 0.010493 0.0756342 -0.0318444 0.0261968 -0.1053528 0.0865137 0.0037654 0.0677999 0.057341 0.0977027 0.0109207 -0.0304329 0.0174375 0.012416 -0.0505998 -0.0110431 -0.0543595 -0.0750708 -0.0668401 -0.0242852 0.0882692 -0.0389569 0.0388541 0.0138133 0.0774554 -0.0186007 -0.0541479 0.2044605 -0.134816 0.1562379 -0.0499583 0.130571 0.0162813 0.0974227 0.0089644 0.1256963 0.3231638 -0.1117084 -0.0812694 -0.0255092 0.1734007 0.0028133 -0.0560051 -0.0464532 0.0780626 0.3754421 -0.0006373 -0.0009181 0.0152554 0.3149772 0.1598611 0.0087313 0.0718084 0.2222827 0.1248596 0.0389204 -0.1182017 -0.0149656 0.3152768 -0.0298333 -0.1549665 -0.0190299 0.3120103 0.3865259 0.0445214 -0.0460846 0.0446483 0.2202049 0.0803438 -0.0821586 0.131803 0.2393709 unknown
polarizability: 109.6734931|-5.033397|97.6031302|5.0052679|2.7204002|88.2127179 unknown
InChI: InChI=1S/C7H13NO5/c8-4(6(10)11)2-1-3-5(9)7(12)13/h4-5,9-10,12H,1-3,8H2
charge 0 multiplicity 1
26 atoms
O  -2.868503 -1.860993 -0.714484
O  3.996531 -1.346996 -0.407321
O  -3.324839 1.358377 0.999713
O  4.338482 0.644953 0.740193
O  -3.504851 0.751467 -1.238223
N  1.930293 1.718378 -0.479142
C  -0.283861 -0.345408 -0.044996
C  1.154833 -0.439275 0.501978
C  -1.319189 -0.885131 0.962786
C  2.176389 0.271092 -0.437335
C  -2.766059 -0.927617 0.40257
C  3.600628 -0.076241 0.03193
C  -3.235582 0.454143 -0.05007
H  -0.488733 0.713792 -0.292993
H  -0.359118 -0.926754 -0.984787
H  1.212862 0.032666 1.504539
H  1.448509 -1.499989 0.619827
H  -1.317892 -0.27377 1.886021
H  -1.065845 -1.923824 1.248585
H  2.048636 -0.144374 -1.45366
H  -3.448422 -1.276599 1.201823
H  2.351133 2.187953 -1.287669
H  2.195118 2.185599 0.396605
H  -3.058934 -1.336335 -1.539572
H  4.904344 -1.556688 -0.054515
H  -3.61553 2.247675 0.659197
