program: Gaussian 09
title: 000192123
version: EM64L-G09RevD.01
frameworkgroup: C1[X(C23H31NO3S)]
method: RPBEPBE
basis: SDD
operation: Freq
keyword: #p
keyword: freq=noraman
keyword: PBEPBE/SDD
title: #p freq=noraman PBEPBE/SDD
converged: YES YES NO NO
title: Mulliken charges:
elementType: S O O O N C C C C C C C C C C C C C C C C C C C C C C C H H H H H H H H H H H H H H H H H H H H H H H H H H H H H H H
charge: -0.046954 -0.262234 -0.264148 -0.209916 -0.236715 -0.022767 -0.021752 -0.399257 -0.399864 -0.322602 -0.316662 -0.704764 -0.710606 -0.705714 -0.712270 0.356008 0.356337 0.267709 0.375639 -0.368383 -0.357430 -0.336101 -0.394394 -0.291168 -0.353630 -0.306465 -0.315971 -0.139735 0.191408 0.191425 0.210511 0.216215 0.216782 0.207771 0.202953 0.223858 0.201411 0.216396 0.208632 0.214648 0.215385 0.210726 0.214833 0.215954 0.207935 0.213183 0.215897 0.209893 0.215203 0.214190 0.254927 0.246933 0.252427 0.251676 0.257719 0.254098 0.261681 0.289850 0.139286
chargesum: 0.00000
title: Mulliken charges with hydrogens summed into heavy atoms:
elementType: S O O O N C C C C C C C C C C C C C C C C C C C C C C C
charge: 0.092333 -0.262234 -0.264148 -0.209916 -0.236715 0.168641 0.169673 0.027469 0.024689 0.104209 0.101145 -0.066099 -0.069093 -0.068699 -0.072983 0.356008 0.356337 0.267709 0.375639 -0.113457 -0.110496 -0.083674 -0.142718 -0.033449 -0.099531 -0.044784 -0.026121 -0.139735
polarizability: 4.06217738e+02 -2.18271047e+00 3.14792300e+02 -3.84873724e+00 -4.16825446e+00 1.97775317e+02
1716.lowfreq: -12.5217 -7.7841 0.0007 0.0020 0.0020 2.9740 4.9179 9.2260 19.7660
frequency: -8.7372 -5.3591 19.6616 30.3000 34.5216 40.5835 46.0980 49.1582 59.2622 62.8248 72.4146 102.2954 107.2214 120.2289 144.1737 148.8749 160.6586 168.1435 173.9530 195.1059 195.6274 208.3825 216.6860 225.9297 240.4484 249.5121 286.3069 302.3705 309.6855 328.8509 339.0744 368.4433 377.2521 382.0078 394.5846 401.5890 412.4835 419.5707 429.1052 432.0709 446.2682 463.0209 492.4162 508.5348 519.9285 539.7641 579.4656 609.2368 628.8180 633.5289 643.7168 715.3286 720.2708 742.8633 779.0733 787.8509 798.2659 800.5421 811.8989 817.2392 831.3493 834.6653 835.7269 836.5917 893.0690 915.4293 916.1472 927.9103 934.4336 937.2631 941.2002 946.0699 951.8739 954.2369 958.6441 965.3592 967.9916 973.6314 982.3953 984.6415 1000.6101 1003.4096 1079.1051 1080.3017 1110.3369 1125.6731 1132.8266 1140.7086 1141.3401 1152.8415 1153.9790 1172.7719 1175.1508 1177.5821 1186.3937 1212.2881 1212.6526 1222.6493 1224.6358 1260.9640 1271.9141 1275.7519 1278.2683 1285.2102 1286.5850 1296.2552 1313.5498 1329.9748 1329.9866 1333.3174 1335.0614 1364.8763 1371.9717 1378.2335 1379.4741 1384.5828 1387.6999 1397.1829 1399.0558 1421.6693 1428.6262 1460.0715 1460.3564 1468.7832 1469.0532 1473.4360 1474.1676 1480.4565 1481.4131 1483.2997 1484.2314 1489.0973 1490.1466 1497.6192 1500.3415 1578.4960 1581.0009 1614.1641 1624.0640 1630.7362 2433.9338 2946.2188 2950.3539 2955.1703 2956.2376 2968.5685 2969.5904 2971.3440 2972.6422 2987.3743 2988.6563 3006.6414 3013.5345 3052.1823 3054.0375 3061.2072 3062.4601 3068.2521 3069.9563 3070.0999 3070.8998 3073.2251 3074.7800 3148.6838 3151.2411 3151.4798 3161.0504 3171.1210 3171.4835 3174.9725 3203.0706
redmass: 3.5257 3.4833 3.7574 3.3692 3.6767 3.7180 4.8100 4.7194 4.1972 6.1321 4.7781 3.5047 3.2301 5.3709 2.1656 2.2651 4.2817 4.8078 3.8715 1.1285 4.9508 1.2002 2.5791 3.6014 1.1399 1.1566 5.3158 2.1279 1.4703 4.7179 4.4998 3.0606 3.7052 3.0570 4.1052 2.6814 3.0198 2.9922 2.3968 2.2686 5.1409 5.2190 3.9323 3.7978 2.6687 3.3741 4.2313 9.4628 7.2631 6.9155 7.1014 3.9719 4.3055 4.1855 3.3180 1.9829 1.4592 1.7063 1.3417 1.3231 1.7181 1.7876 2.1122 2.4782 1.3415 1.1748 1.1737 4.0319 1.4360 1.5739 1.5909 1.4953 1.3897 1.3690 1.3520 1.3619 7.0024 7.6153 1.5070 1.5173 2.8237 2.4731 2.9632 2.9350 1.3007 2.4315 1.6707 2.2946 2.2805 1.6250 1.6152 1.2829 1.6457 1.7649 1.3288 1.4145 1.3936 2.8035 2.5169 5.4044 3.5716 1.3492 1.2647 1.1590 1.1555 1.3274 1.3599 1.4485 1.4513 1.4527 1.4413 4.2304 2.6339 1.2997 1.3032 1.4545 1.8163 1.2402 1.2263 4.0016 3.8015 1.0815 1.0781 1.0494 1.0451 1.0672 1.0618 1.1875 1.1282 1.1108 1.1411 1.0519 1.0525 1.8747 2.0487 7.4549 7.4904 7.4498 6.4551 9.3383 1.0374 1.0563 1.0578 1.0828 1.0820 1.0356 1.0357 1.0363 1.0367 1.0596 1.0595 1.1039 1.1040 1.1041 1.1043 1.0996 1.0996 1.0996 1.0991 1.1001 1.0989 1.0990 1.0988 1.0890 1.0879 1.0880 1.0907 1.0956 1.0956 1.0972 1.0945
irintensity: 0.1544 0.0707 0.0207 0.0152 0.1341 0.0282 0.3875 0.1699 0.0836 0.1545 0.1001 0.5539 0.4872 1.5956 2.2677 3.5025 1.1494 1.2688 1.1176 0.4194 4.4834 0.2252 0.2630 0.8052 0.1397 0.0350 5.0927 18.6458 24.9284 1.2864 2.4938 0.6839 1.5841 0.5155 2.5132 0.3658 1.1218 0.0430 1.2081 0.5462 1.8978 0.8729 0.4094 2.4508 20.4852 7.2276 100.7919 2.4519 11.5892 6.6528 5.5357 1.3900 2.7517 56.6706 18.9096 27.1310 2.6196 16.7174 4.2954 0.4484 54.2925 16.6442 7.0288 28.9658 15.2409 3.7002 3.4236 18.1634 2.0718 7.8247 11.7472 2.2584 0.6501 0.8654 1.5429 1.9363 104.1640 121.2202 0.9009 0.8086 10.0438 26.6687 5.9200 7.9171 15.2040 113.1824 23.3032 3.3543 6.2744 4.7423 4.4256 147.0269 2.0845 25.0309 80.3944 36.9370 36.2956 281.1999 431.1337 156.9423 18.9176 9.2922 0.7348 0.2994 0.1565 4.9465 11.9290 1.0659 0.3444 6.4373 4.9151 3.5595 18.8537 10.4474 30.2111 21.0147 41.7011 6.3640 8.2179 4.1230 8.0760 6.1798 5.2344 2.1330 3.3460 9.3048 5.1759 157.8815 65.4967 24.3118 49.6741 25.1055 25.8477 248.2126 100.0905 0.8713 21.5354 25.7198 28.2907 337.0850 29.4767 31.2851 24.4964 21.2875 25.1979 39.8770 39.5344 25.4430 23.3056 29.1362 27.6512 20.6184 15.3799 27.3134 24.1156 13.7655 13.7073 34.1658 93.7543 28.8972 96.5706 79.3779 86.3366 10.7253 15.3526 5.8970 6.5380 6.4041 10.5762 2.0513 0.8137
temp: 298.150 k
press: 1.00000 atm
elementType: 16 8 8 8 7 6 6 6 6 6 6 6 6 6 6 6 6 6 6 6 6 6 6 6 6 6 6 6 1 1 1 1 1 1 1 1 1 1 1 1 1 1 1 1 1 1 1 1 1 1 1 1 1 1 1 1 1 1 1
symmnumber: 1
zpe: 1279101.0 jmol-1
zpe.correction: 0.487184 hartree
zpe.thermalcorrener: 0.516042 hartree
zpe.thermalcorrenthalpy: 0.516986 hartree
zpe.thermalcorrgfe: 0.425645 hartree
zpe.sumelectzpe: -1571.405869 hartree
zpe.sumelectthermal: -1571.377011 hartree
zpe.sumelectthermalent: -1571.376067 hartree
zpe.sumelectthermalfe: -1571.467408 hartree
dipole: 2.1393 -5.7943 -0.9035
dipole: 6.2424
quadrupole: -152.0483 -182.1961 -174.8769
quadrupole: 5.6408 -6.6432 6.3811
quadrupole: 17.6588 -12.4890 -5.1698 5.6408 -6.6432 6.3811
hfenergy: -1571.8930526 hartree
pointgroup: C01 [X(C23H31N1O3S1)]
dipole: 0.9537276 -2.1981553 -0.5386701 debye
polarizability: 406.2023632|2.6711768|314.7250443|-3.5987058|5.2853158|197.8579475 unknown
InChI: InChI=1S/C23H31NO3S/c1-17(2)13-15-26-21-9-5-19(6-10-21)24(23(25)28)20-7-11-22(12-8-20)27-16-14-18(3)4/h5-12,17-18,28H,13-16H2,1-4H3
charge 0 multiplicity 1
59 atoms
S  1.904913 4.600085 0.427176
O  4.481347 -0.69066 1.019685
O  -5.129006 0.077611 0.202998
O  -0.805831 4.876964 0.030877
N  -0.046703 2.653419 0.312535
C  7.466303 -2.474674 -0.586958
C  -7.079223 -3.130407 -0.549949
C  6.492016 -1.909524 0.481964
C  -6.733657 -1.705467 -0.039774
C  5.398119 -1.009222 -0.096514
C  -5.251765 -1.344584 -0.171705
C  8.45155 -3.467266 0.074305
C  8.240839 -1.356672 -1.328465
C  -8.608792 -3.354784 -0.486849
C  -6.337195 -4.237237 0.239731
C  3.388173 0.140152 0.758607
C  -3.847285 0.647482 0.196125
C  1.127411 1.806856 0.461302
C  -1.34782 2.006338 0.259672
C  2.563144 0.426777 1.878861
C  -2.657758 -0.036791 -0.152686
C  3.074545 0.68311 -0.514225
C  -3.778315 2.011103 0.573326
C  1.440469 1.256271 1.729087
C  -1.421794 0.643784 -0.120257
C  1.939023 1.510233 -0.654364
C  -2.547769 2.68734 0.608246
C  0.105575 4.035981 0.216108
H  6.866375 -3.0350 -1.3364
H  -6.767227 -3.198462 -1.614823
H  7.063985 -1.341536 1.241566
H  6.00017 -2.748757 1.010547
H  -7.319101 -0.959195 -0.610789
H  -7.035895 -1.607008 1.021533
H  4.834934 -1.532605 -0.898195
H  5.812472 -0.066515 -0.505978
H  -4.900456 -1.485588 -1.216399
H  -4.618483 -1.955851 0.502622
H  9.072473 -2.952521 0.832728
H  9.132945 -3.910522 -0.67504
H  7.915876 -4.292626 0.578929
H  8.80091 -0.728542 -0.608808
H  7.571666 -0.694387 -1.907802
H  8.970939 -1.789892 -2.036622
H  -8.96723 -3.303284 0.559303
H  -8.882718 -4.347541 -0.889252
H  -9.152933 -2.588029 -1.069057
H  -6.567458 -4.165024 1.320404
H  -5.239847 -4.173126 0.121753
H  -6.649796 -5.240331 -0.104993
H  2.829163 -0.002727 2.849073
H  -2.673194 -1.08856 -0.452208
H  3.695857 0.474229 -1.389118
H  -4.705126 2.528455 0.839231
H  0.802469 1.48725 2.588061
H  -0.511213 0.101044 -0.389047
H  1.686685 1.937921 -1.630067
H  -2.519587 3.741179 0.886403
H  1.521132 5.929933 0.35019
