program: Gaussian 09
title: 000192112
version: EM64L-G09RevD.01
frameworkgroup: C1[X(C23H26NO3)]
method: RPBEPBE
basis: SDD
operation: Freq
keyword: #p
keyword: freq=noraman
keyword: PBEPBE/SDD
title: #p freq=noraman PBEPBE/SDD
converged: NO YES NO NO
title: Mulliken charges:
elementType: O O O N C C C C C C C C C C C C C C C C C C C C C C C H H H H H H H H H H H H H H H H H H H H H H H H H H
charge: -0.285967 -0.199367 -0.265026 -0.100849 -0.073038 -0.084726 -0.511515 -0.509592 -0.564997 -0.547201 0.006175 -0.585135 -0.567438 0.287289 -0.505171 0.335025 0.370109 0.141498 0.131826 -0.397698 -0.393712 -0.352696 -0.353110 -0.254894 -0.249213 -0.214451 -0.211848 0.294115 0.292986 0.264851 0.283268 0.283174 0.273801 0.275277 0.264076 0.260000 0.307950 0.272008 0.264890 0.265991 0.285918 0.263995 0.286257 0.265970 0.283203 0.237625 0.233118 0.270016 0.267383 0.233828 0.238019 0.244081 0.243920
chargesum: 1.00000
title: Mulliken charges with hydrogens summed into heavy atoms:
elementType: O O O N C C C C C C C C C C C C C C C C C C C C C C C
charge: -0.285967 -0.199367 -0.265026 -0.100849 0.221077 0.208261 0.036605 0.047382 -0.025645 0.020750 0.278183 0.231663 0.248785 0.287289 -0.221968 0.335025 0.370109 0.141498 0.131826 -0.160073 -0.160595 -0.082679 -0.085727 -0.021066 -0.011194 0.029630 0.032071
polarizability: 2.80966313e+02 -2.67194702e+01 2.86557411e+02 3.42068787e+01 9.72467512e+00 1.87266907e+02
1716.lowfreq: -21.1234 -7.1910 -5.2476 -0.0029 -0.0011 -0.0007 5.5576 19.3823 23.8302
frequency: -15.9541 18.5491 23.0776 41.3932 57.0147 80.7648 93.5463 125.7588 137.1757 148.3770 170.7897 194.8096 214.4150 227.0103 250.9454 268.6989 276.4283 299.9117 310.1541 332.5636 366.5498 377.7827 380.0784 391.4025 396.8385 413.8863 446.0501 455.1634 462.3495 476.3621 506.0087 517.6631 527.4864 533.7746 542.2718 593.7275 605.7638 631.9684 654.0918 664.5288 672.1393 690.3508 719.4581 732.3856 745.2365 757.9254 765.2195 766.0979 802.8418 818.1929 827.3941 851.4264 861.2516 861.7016 867.8460 878.2683 882.2678 888.6265 893.2324 908.5061 914.1881 946.9000 950.1689 980.5022 982.0162 985.2929 988.3519 1001.0039 1013.4754 1029.9340 1030.9880 1031.4042 1035.7398 1052.9374 1088.1133 1089.7908 1092.0805 1107.7128 1127.8855 1155.7636 1163.7672 1167.1897 1167.7629 1169.8083 1171.7546 1185.3549 1190.0422 1202.2508 1203.9651 1214.0286 1226.9765 1230.4318 1241.3762 1256.4779 1265.0039 1280.5138 1284.4036 1297.2762 1302.7353 1314.1852 1319.7254 1322.5044 1327.1791 1339.3773 1356.1317 1378.3848 1388.2187 1393.2045 1415.6024 1440.6858 1445.1594 1448.6401 1457.6435 1459.7393 1471.0761 1477.0274 1478.8313 1482.8704 1491.1880 1493.9871 1508.8719 1513.9997 1582.1337 1603.3669 1607.9255 1628.6229 1654.6300 3019.1573 3023.9376 3026.3365 3030.3683 3031.0681 3033.7901 3036.4653 3044.0479 3061.8474 3068.8868 3077.2014 3080.6347 3090.5480 3109.0137 3119.4095 3120.7229 3130.6842 3137.1086 3145.6172 3147.9814 3162.4725 3165.4509 3171.9855 3178.2304 3179.3830 3181.0350
redmass: 3.9285 4.6926 4.4027 4.8432 5.3390 6.3418 5.4161 4.1274 1.2690 5.0466 4.6243 2.0166 5.2338 1.2073 4.9118 4.4400 2.1633 3.6638 4.9442 4.8649 6.3705 2.4694 2.4032 4.2921 3.4568 2.2444 2.9358 3.1979 3.4843 2.3828 3.7406 5.0134 4.2393 4.2792 3.7786 6.3555 6.8228 3.8642 5.5651 3.9086 6.1363 4.9839 5.1132 4.3452 3.3370 3.3786 1.3666 1.4047 1.6643 2.6867 4.3572 2.2673 2.0119 4.3644 1.4745 1.5231 2.7810 3.5793 4.5939 3.6091 3.0000 1.3868 1.4144 2.1826 4.1047 1.3198 1.3241 2.2648 1.8229 2.2117 1.6754 1.9915 2.3769 2.6757 1.2968 2.2557 2.0497 2.2834 1.2071 1.8591 1.2629 1.9446 2.0267 1.0910 1.0764 1.7665 1.5148 1.4395 1.5298 2.3298 1.4165 1.3111 3.1166 1.4918 1.4767 1.8382 1.4245 1.4224 1.4486 1.7184 1.3799 1.3702 1.4583 1.4029 1.4385 1.3739 7.5850 10.0574 1.1344 2.4171 1.1593 2.4974 1.0536 1.0572 2.5733 1.0624 1.0536 2.7224 1.0737 1.0609 1.0801 1.0577 6.5781 7.3186 7.1054 7.5238 10.1595 1.0739 1.0667 1.0671 1.0365 1.0844 1.0360 1.0625 1.0651 1.0868 1.0895 1.1013 1.1014 1.1040 1.1042 1.0895 1.0885 1.1048 1.1044 1.0891 1.0884 1.0944 1.0942 1.1018 1.0992 1.0997 1.1010
irintensity: 1.1882 1.1279 0.5338 0.6234 1.7977 0.7180 1.4291 0.2272 0.7838 3.0903 8.4327 0.3218 0.3793 0.0622 1.0135 0.7368 0.2695 4.8472 0.8637 4.9994 0.9253 0.8294 0.6198 0.2141 0.5294 0.1363 4.3470 2.0084 3.2282 1.5071 0.8407 0.9456 4.3960 0.8197 3.5320 6.4416 3.6561 2.0654 9.3890 2.6320 7.1098 14.6494 0.6229 3.3123 8.3260 39.9405 108.3325 39.7905 6.2133 0.4564 22.8582 19.2758 1.6797 3.8136 1.1245 5.0479 32.7536 4.2218 22.9072 51.3267 10.2004 1.5160 2.1430 21.4385 84.5054 2.0366 0.9928 2.2949 2.2777 8.6053 30.5812 4.3793 220.8597 207.6718 1.7918 21.5369 1.4885 27.4007 5.7149 4.2311 0.0079 3.3437 5.1640 4.5526 2.0157 67.7157 0.5684 1.8868 19.5595 32.7623 1.5937 2.8078 224.1740 22.9289 54.4345 4.2390 0.8251 0.7426 23.2806 7.3898 4.5945 0.9684 2.9212 3.5695 0.5085 6.8556 2.8098 1.4532 9.2596 79.1702 27.4117 15.9446 7.0257 4.4614 146.1684 69.4035 22.3883 9.8408 48.2317 1.3162 17.2532 5.5421 36.4076 11.4327 15.7026 10.8280 98.1700 4.1443 6.9606 7.9579 3.2481 5.6741 8.6962 5.4735 11.8851 14.7752 12.6166 1.0210 15.3185 0.4297 20.4735 6.1320 9.2996 0.3923 4.8619 7.6395 6.4770 16.7721 12.6138 3.9577 9.0897 7.7905 2.5585
temp: 298.150 k
press: 1.00000 atm
elementType: 8 8 8 7 6 6 6 6 6 6 6 6 6 6 6 6 6 6 6 6 6 6 6 6 6 6 6 1 1 1 1 1 1 1 1 1 1 1 1 1 1 1 1 1 1 1 1 1 1 1 1 1 1
symmnumber: 1
zpe: 1163997.4 jmol-1
zpe.correction: 0.443343 hartree
zpe.thermalcorrener: 0.465420 hartree
zpe.thermalcorrenthalpy: 0.466364 hartree
zpe.thermalcorrgfe: 0.391819 hartree
zpe.sumelectzpe: -1170.272630 hartree
zpe.sumelectthermal: -1170.250553 hartree
zpe.sumelectthermalent: -1170.249609 hartree
zpe.sumelectthermalfe: -1170.324154 hartree
dipole: -19.6216 0.4522 -1.5491
dipole: 19.6879
quadrupole: -38.9937 -129.4539 -149.9461
quadrupole: -6.2702 2.6374 3.2089
quadrupole: 67.1375 -23.3227 -43.8149 -6.2702 2.6374 3.2089
hfenergy: -1170.7159734 hartree
pointgroup: C01 [X(C23H26N1O3)]
dipole: 7.543534 1.6473753 0.6153486 debye
polarizability: 267.3114533|40.2569491|274.6989402|27.7675953|-39.4313343|212.7802379 unknown
InChI: InChI=1S/C23H26NO3/c1-24(2)15-11-12-16(24)14-17(13-15)26-23(25)22-18-7-3-5-9-20(18)27-21-10-6-4-8-19(21)22/h3-10,15-17,22H,11-14H2,1-2H3
charge 1 multiplicity 1
53 atoms
O  0.813211 -0.06932 0.966335
O  -0.072573 -1.494606 -0.654745
O  -3.644332 -0.575491 -1.278652
N  4.779579 0.989032 0.06977
C  4.603006 -0.137477 1.148013
C  4.000812 0.331589 -1.126655
C  4.973478 -1.41769 0.346731
C  4.584479 -1.109039 -1.141402
C  3.138668 -0.157174 1.636051
C  2.489188 0.340316 -0.82218
C  2.161637 -0.446005 0.475215
C  4.261626 2.356034 0.488691
C  6.255237 1.168866 -0.281328
C  -0.267528 -0.687612 0.273474
C  -1.612966 -0.174388 0.810805
C  -2.071492 0.950653 -0.122576
C  -2.625775 -1.310202 0.857931
C  -3.01663 0.678662 -1.142365
C  -3.548875 -1.486262 -0.197942
C  -1.534393 2.257179 -0.033591
C  -2.632746 -2.24905 1.916054
C  -3.398993 1.669236 -2.072643
C  -4.442009 -2.576674 -0.228057
C  -1.913568 3.261992 -0.948315
C  -3.521893 -3.343919 1.909461
C  -2.840133 2.958914 -1.977408
C  -4.420939 -3.510244 0.827465
H  5.296889 0.081696 1.97715
H  4.230429 0.913634 -2.035351
H  4.416062 -2.280228 0.745109
H  6.043332 -1.663087 0.444492
H  5.455411 -1.188322 -1.812086
H  3.827076 -1.811461 -1.523743
H  3.051782 -0.950507 2.399529
H  2.86225 0.781904 2.145802
H  2.088546 1.367656 -0.758237
H  1.97115 -0.136811 -1.672502
H  2.139615 -1.526446 0.24089
H  4.831026 2.692792 1.369314
H  4.418305 3.060223 -0.343476
H  3.195995 2.32044 0.735783
H  6.784104 1.559366 0.602135
H  6.700544 0.21336 -0.581818
H  6.335641 1.888972 -1.110332
H  -1.42704 0.229778 1.821443
H  -0.821103 2.482186 0.768913
H  -1.931675 -2.119639 2.75013
H  -4.136115 1.416279 -2.840057
H  -5.138927 -2.669789 -1.065766
H  -1.504233 4.273411 -0.858419
H  -3.51718 -4.061727 2.735597
H  -3.140145 3.731718 -2.692595
H  -5.111716 -4.359419 0.811859
