program: Gaussian 09
title: 000192095
version: EM64L-G09RevD.01
frameworkgroup: C1[X(C9H10O4)]
method: RPBEPBE
basis: SDD
operation: Freq
keyword: #pfreq=noraman
keyword: PBEPBE/SDD
title: #p freq=noraman PBEPBE/SDD
converged: YES YES NO NO
title: Mulliken charges:
elementType: O O O O C C C C C C C C C H H H H H H H H H H
charge: -0.478885 -0.433794 -0.400577 -0.265376 -0.203937 0.442988 -0.525253 -0.389789 -0.364231 -0.388572 -0.339948 0.280828 0.216578 0.214699 0.281059 0.263945 0.227710 0.286399 0.217900 0.250031 0.373568 0.351955 0.382702
chargesum: 0.00000
title: Mulliken charges with hydrogens summed into heavy atoms:
elementType: O O O O C C C C C C C C C
charge: -0.105318 -0.081839 -0.017874 -0.265376 0.010762 0.442988 0.019751 -0.162079 -0.077832 -0.170672 -0.089917 0.280828 0.216578
polarizability: 1.55796244e+02 5.37940023e+00 1.01946746e+02 8.32453842e+00 -1.06236148e+01 6.86111396e+01
1716.lowfreq: -9.9454 -4.3936 -0.0004 0.0008 0.0009 6.7533 25.7444 49.0765 65.8850
frequency: 25.4787 49.0634 65.8734 76.9060 164.4923 211.1454 221.0633 315.6206 342.7580 348.4077 374.6290 409.9591 426.7093 464.0028 510.0665 533.7155 565.4204 584.5847 606.7312 634.3836 668.7619 722.8269 762.4231 800.2221 822.5749 843.5919 860.4028 893.8515 928.0522 982.4072 1003.6535 1020.6969 1034.4631 1073.7605 1102.8959 1142.0425 1172.4136 1183.7922 1193.4536 1230.0410 1242.6994 1246.2306 1305.5235 1313.4462 1349.6096 1394.9089 1400.8130 1416.3375 1424.3836 1506.2232 1599.7342 1628.4309 1634.6835 2934.6570 3004.8341 3077.7531 3105.0006 3128.6470 3159.4765 3180.4655 3458.4421 3500.3036 3582.7216
redmass: 4.6821 8.5503 5.0172 4.0500 5.3553 7.6523 5.4775 5.5114 5.3144 1.1805 4.4603 2.9802 5.0461 2.0147 2.8036 3.7966 2.7773 1.0710 3.1758 6.6272 1.6516 3.6958 4.6217 1.4233 5.0039 1.5977 2.8226 2.9750 1.4373 1.3460 2.8436 2.9844 4.6770 2.1886 1.4410 1.3720 1.1523 1.2477 1.8605 1.1693 1.4551 2.7806 1.1843 1.2586 2.1855 4.1741 1.8712 1.1181 2.8753 2.8467 6.6524 6.4680 7.4573 1.0840 1.0631 1.0970 1.0868 1.0969 1.0886 1.0965 1.0653 1.0638 1.0660
irintensity: 0.5276 1.2900 0.0971 0.7513 0.8243 1.5346 4.3781 4.5679 14.4864 135.9258 12.9508 0.8705 7.5782 13.0619 22.7630 45.3833 107.7668 151.4199 35.5388 3.0282 119.1634 0.4190 10.5111 39.3107 13.1880 30.8126 27.6352 6.2609 0.5642 0.8682 9.5141 33.1146 28.0316 302.6640 45.5729 217.3176 19.0723 2.0273 34.4288 18.9043 19.6409 23.6244 1.2661 44.5766 83.2262 24.7472 67.6815 34.1288 19.1628 85.7577 9.4322 25.0277 212.0483 44.0371 4.4453 4.9737 18.7743 19.3801 3.1883 3.6916 94.3631 18.9394 36.6497
temp: 298.150 k
press: 1.00000 atm
elementType: 8 8 8 8 6 6 6 6 6 6 6 6 6 1 1 1 1 1 1 1 1 1 1
symmnumber: 1
zpe: 460374.8 jmol-1
zpe.correction: 0.175348 hartree
zpe.thermalcorrener: 0.187634 hartree
zpe.thermalcorrenthalpy: 0.188578 hartree
zpe.thermalcorrgfe: 0.135340 hartree
zpe.sumelectzpe: -648.886629 hartree
zpe.sumelectthermal: -648.874344 hartree
zpe.sumelectthermalent: -648.873399 hartree
zpe.sumelectthermalfe: -648.926637 hartree
dipole: 1.1952 -3.9154 0.1964
dipole: 4.0985
quadrupole: -64.7761 -75.2003 -76.9060
quadrupole: 2.7136 -5.3651 -5.6171
quadrupole: 7.5180 -2.9061 -4.6119 2.7136 -5.3651 -5.6171
hfenergy: -649.061977 hartree
pointgroup: C01 [X(C9H10O4)]
dipole: -0.4656578 0.4365011 -1.4807753 debye
dipolederiv: -0.5766989 -0.1334455 0.1046933 -0.1161495 -0.507085 -0.0240379 0.1504054 -0.0509387 -0.7736781 -1.515929 0.1083127 0.193663 0.1452137 -0.2745887 -0.209002 0.2145206 -0.2051213 -0.2655011 -0.7190713 -0.1180587 -0.5198026 -0.0892189 -0.427011 -0.0879539 -0.5704023 -0.1087913 -0.9294996 -0.8168954 0.070134 0.2210508 0.0349061 -0.3635939 -0.174454 -0.115422 -0.1694046 -0.9399895 0.5828734 0.0826282 -0.0824446 0.1115748 0.4265474 0.0223993 -0.0799896 0.0073426 0.5976902 0.07575 -0.0126715 0.0099046 -0.0019003 -0.1419891 0.0391111 -0.0354064 0.042815 -0.1707231 -0.5003254 0.0317492 -0.037463 0.1045522 0.0204164 -0.1046441 0.0997748 -0.0884889 -0.1442833 0.05512 0.0181371 -0.10822 -0.0525444 -0.0187588 -0.1078038 -0.0221946 -0.1365886 0.0101597 0.0492953 -0.0851454 0.0075295 -0.0717178 -0.0188724 -0.0926168 -0.0652837 -0.0966344 0.0203679 -0.3373915 -0.0183736 0.049181 0.2157507 -0.1275292 -0.1435673 -0.185956 -0.0755721 -0.0670906 -0.2759558 -0.0031036 0.0179446 -0.1751405 -0.054171 -0.0783625 0.2430429 -0.1352789 -0.0885237 1.4070042 -0.1414966 -0.2591964 -0.1693404 0.0857762 0.040438 -0.2753892 0.0362417 0.1195551 1.3979459 -0.065346 0.1512994 -0.1276003 0.2875019 0.2849693 0.3694071 0.3068448 1.4650556 -0.0344306 0.0470692 0.0181643 0.0267196 -0.1807569 0.0385586 -0.0165662 0.0499874 -0.0291546 0.0932867 0.0236392 -0.0058042 -0.0066018 -0.0244966 -0.011658 0.011908 0.0349126 0.1121513 0.0905458 -0.0202688 0.0192329 -0.0269804 0.0934836 0.056263 0.0330535 0.0340164 -0.0553249 0.0270563 0.0977336 -0.055883 0.0982423 0.0282263 0.0900667 -0.0540679 0.0881935 0.0564269 0.137217 -0.025141 0.0481207 -0.0412091 0.0948476 0.0649112 0.0430191 0.0731589 0.0613933 -0.0148234 -0.0439185 0.1035065 -0.0363619 0.0841905 0.1065015 0.1054572 0.1102709 0.0232567 0.0332423 0.0718441 -0.0377692 0.0803828 0.0697178 0.0867128 -0.0367831 0.0887928 0.0816183 0.2936676 0.0708649 0.0984049 0.0553331 0.3333228 0.050225 0.0458091 0.0632059 0.4317871 0.4057174 0.0171474 -0.0188871 -0.0176401 0.2295373 0.1746338 0.0092554 0.1633687 0.1984395 0.1427995 0.0277095 0.0827747 0.0597301 0.3852847 -0.0206899 0.1318079 -0.0323323 0.2858669 unknown
polarizability: 155.7022234|-7.4343108|75.3176235|-7.2392477|-16.9615404|95.334283 unknown
InChI: InChI=1S/C9H10O4/c10-7-3-1-6(2-4-7)8(11)5-9(12)13/h1-4,8,10-12H,5H2
charge 0 multiplicity 1
23 atoms
O  -1.373636 -0.066103 1.872834
O  4.582597 -0.409433 -0.383819
O  -4.071618 -0.36373 -1.529075
O  -3.935208 0.160598 0.720919
C  -1.041591 0.443355 0.543067
C  0.451568 0.251684 0.310456
C  -1.864199 -0.308781 -0.547774
C  1.112674 0.977346 -0.708638
C  1.194649 -0.675844 1.081936
C  2.486798 0.779981 -0.966175
C  2.566893 -0.882216 0.837876
C  3.211495 -0.156823 -0.189976
C  -3.356333 -0.140784 -0.355392
H  -1.289715 1.526375 0.474677
H  -1.626427 -1.389055 -0.484008
H  -1.586657 0.019808 -1.564044
H  0.560903 1.715356 -1.305146
H  0.685255 -1.211827 1.887348
H  2.987602 1.354971 -1.75626
H  3.152231 -1.590231 1.432078
H  -2.356072 0.054111 1.993905
H  4.942759 0.148701 -1.116906
H  -5.047966 -0.273159 -1.349686
