program: Gaussian 09
title: 000192093
version: EM64L-G09RevD.01
frameworkgroup: C1[X(C14H23N3O4S)]
method: RPBEPBE
basis: SDD
operation: Freq
keyword: #p
keyword: freq=noraman
keyword: PBEPBE/SDD
title: #p freq=noraman PBEPBE/SDD
converged: YES YES NO NO
title: Mulliken charges:
elementType: S O O O O N N N C C C C C C C C C C C C C C H H H H H H H H H H H H H H H H H H H H H H H
charge: 0.170368 -0.171932 -0.413738 -0.200248 -0.257442 -0.080829 -0.351864 -0.596898 -0.476481 -0.119280 -0.177282 -0.141141 0.103082 -0.672284 -0.674365 0.175984 0.199483 0.127174 -0.422671 -0.375205 -0.700213 -0.721346 0.330428 0.302844 0.311629 0.231172 0.251228 0.233786 0.235114 0.258047 0.222410 0.312069 0.234685 0.173053 0.227034 0.172584 0.387176 0.265123 0.282439 0.246218 0.207671 0.219328 0.229362 0.218390 0.225336
chargesum: 0.00000
title: Mulliken charges with hydrogens summed into heavy atoms:
elementType: S O O O O N N N C C C C C C C C C C C C C C
charge: 0.170368 -0.171932 -0.026562 -0.200248 -0.257442 -0.080829 -0.039795 -0.049335 -0.146053 -0.119280 0.125562 0.170488 0.103082 0.043902 0.041206 0.175984 0.199483 0.127174 -0.014933 0.024412 -0.026995 -0.048258
polarizability: 2.47201203e+02 9.94298948e-01 1.79752285e+02 -1.20739467e+01 4.53604982e+00 1.74348979e+02
1716.lowfreq: -17.4611 -11.3925 -7.1936 -0.0007 0.0008 0.0017 12.0315 23.6684 29.0828
frequency: 11.0035 23.3931 28.5399 48.0573 59.6845 62.2082 78.1185 89.0833 101.4166 104.4406 134.4416 140.6239 153.0114 174.5604 180.7722 207.5522 216.4651 236.1494 240.6055 258.0390 262.1394 281.6623 286.6254 301.8144 314.5999 333.1203 338.8111 352.9957 375.9566 378.8227 416.5958 454.4928 471.3865 477.9167 497.0281 528.3719 552.3689 559.7267 582.9457 614.7561 618.0576 639.3116 687.2871 703.8672 720.2779 749.2908 755.7243 775.2754 790.7044 807.4942 840.4812 862.0275 897.5977 901.9767 914.9747 930.0476 947.4693 952.5887 982.9076 996.7474 1012.2930 1028.9217 1035.1939 1049.5983 1070.2311 1070.5840 1080.0643 1111.7202 1118.6758 1157.6801 1170.4495 1178.9410 1189.5046 1199.5783 1214.5671 1224.4524 1231.8598 1243.4903 1246.6506 1263.5598 1265.9421 1275.0241 1300.6816 1318.5190 1330.1196 1342.0356 1359.3409 1386.8255 1393.2649 1401.6080 1404.8908 1447.9910 1456.6988 1460.4917 1465.9550 1468.2361 1475.3613 1476.6517 1481.3567 1484.8874 1485.3919 1488.6388 1599.3817 1660.3262 1668.2657 1724.4146 2971.8159 2979.1148 2980.0684 2980.7078 2982.2116 2987.5398 3035.5345 3042.2620 3047.9707 3066.5589 3071.4874 3075.0301 3075.3630 3080.4242 3082.8658 3084.5027 3098.0337 3101.1067 3124.2974 3428.0668 3506.5240 3512.6497 3533.8818
redmass: 3.7251 5.3312 5.0768 5.1115 7.3714 7.1026 4.6988 2.8616 1.9029 7.3850 2.3606 2.9531 2.7574 1.8188 2.6173 2.2863 2.4292 1.9532 1.3054 2.4601 1.9411 1.4139 2.0882 2.7604 3.3274 2.6490 3.7519 3.9844 3.7999 3.4500 4.4493 3.5645 6.5006 3.7084 3.2286 3.7537 3.2330 3.5044 3.3203 1.5305 1.6555 3.4554 3.0737 4.5008 5.8917 1.5733 6.4545 1.2244 2.0696 2.6131 3.7247 4.2783 2.9834 2.5721 2.8070 2.3864 1.6585 2.8005 3.7365 1.6315 1.5136 1.5108 2.5925 1.7158 2.5000 1.8529 2.6707 2.0599 2.3135 1.8506 2.2636 1.9273 1.7706 2.2176 1.8661 2.1826 1.7398 1.5783 1.4194 1.6512 1.2652 2.1051 1.7238 1.5722 1.6847 1.4492 1.9361 1.1893 1.2144 1.2054 1.1860 1.0801 1.0499 1.3076 1.0485 1.3460 1.0518 1.0733 1.0846 1.0425 1.0464 1.0480 7.2031 1.0915 8.9905 12.7359 1.0617 1.0380 1.0471 1.0488 1.0398 1.0360 1.0979 1.0978 1.0839 1.0858 1.0991 1.0961 1.0991 1.1003 1.1003 1.0988 1.1007 1.1003 1.0908 1.0458 1.0641 1.0773 1.0933
irintensity: 0.2015 0.1626 0.4203 8.1851 1.5496 2.1526 5.6733 2.6258 10.9104 2.6195 18.0855 16.9110 4.4384 6.2346 3.3232 1.6901 1.6201 0.5859 1.8602 1.3682 2.7053 2.7491 8.7276 13.4103 25.2708 1.1779 2.1892 2.3200 1.9700 1.0894 6.5195 5.0784 3.9336 16.1080 14.7253 10.9686 7.1186 49.0957 38.7339 71.5641 71.7686 22.3991 50.4101 8.0653 18.2466 97.7734 10.8088 1.5557 78.8947 91.4132 14.5453 31.1092 39.9689 2.1659 6.1753 10.6301 4.7930 10.4257 3.4940 12.9740 23.5016 10.0784 87.6152 0.4647 231.2033 12.8646 2.8681 64.6052 35.8431 23.0796 3.2941 11.8924 8.3649 16.1912 31.5754 4.4930 4.1468 1.8785 2.6253 63.5533 3.6317 178.7941 10.7730 5.8579 0.3903 0.1410 30.3698 21.4782 17.8657 13.0978 13.9685 1.3321 5.8818 129.5951 11.0093 162.9485 11.5328 42.6850 48.1524 11.4682 8.7341 8.3052 137.9435 69.3082 178.5763 333.8806 14.0665 15.1716 57.0158 29.8914 12.5625 20.6850 1.9954 28.2944 24.5810 0.7818 40.6706 17.8805 40.1106 32.2379 73.2173 14.4138 8.2319 20.3860 3.5793 0.7356 35.8512 32.9940 1.6598
temp: 298.150 k
press: 1.00000 atm
elementType: 16 8 8 8 8 7 7 7 6 6 6 6 6 6 6 6 6 6 6 6 6 6 1 1 1 1 1 1 1 1 1 1 1 1 1 1 1 1 1 1 1 1 1 1 1
symmnumber: 1
zpe: 955653.2 jmol-1
zpe.correction: 0.363989 hartree
zpe.thermalcorrener: 0.388977 hartree
zpe.thermalcorrenthalpy: 0.389922 hartree
zpe.thermalcorrgfe: 0.307326 hartree
zpe.sumelectzpe: -1408.790945 hartree
zpe.sumelectthermal: -1408.765957 hartree
zpe.sumelectthermalent: -1408.765013 hartree
zpe.sumelectthermalfe: -1408.847608 hartree
dipole: -4.2574 -1.6976 3.6521
dipole: 5.8605
quadrupole: -127.1405 -151.3226 -140.6017
quadrupole: 0.1890 -0.0105 1.1085
quadrupole: 12.5478 -11.6344 -0.9134 0.1890 -0.0105 1.1085
hfenergy: -1409.1549341 hartree
pointgroup: C01 [X(C14H23N3O4S1)]
dipole: -1.7220473 1.195653 -0.959769 debye
polarizability: 248.0165413|-5.375138|175.3563284|7.6406704|5.2934949|177.9295973 unknown
InChI: InChI=1S/C14H23N3O4S/c1-5-14(15,6-2)12(21)16-7-9(18)17-8(11(19)20)13(3,4)22-10(7)17/h7-8,10,16,19H,5-6,15H2,1-4H3
charge 0 multiplicity 1
45 atoms
S  -1.242605 1.762999 0.258382
O  -0.669741 -2.462644 -0.776076
O  -5.415307 -0.537191 0.4314
O  -4.053282 0.131887 2.194065
O  3.009275 -1.122604 1.549346
N  -1.83535 -0.844248 0.629223
N  1.381925 -0.086574 0.258996
N  5.149431 -0.005257 0.148124
C  -0.982936 0.171589 1.291082
C  -2.716429 0.98062 -0.769391
C  -3.060674 -0.387633 -0.021452
C  0.278464 -0.708725 0.943708
C  -0.730913 -1.566821 0.081275
C  -3.873241 1.997812 -0.785903
C  -2.216187 0.670427 -2.196822
C  -4.17874 -0.23055 1.007428
C  3.792086 0.43228 -0.232733
C  2.708607 -0.336858 0.60186
C  3.594791 0.176275 -1.760376
C  3.655917 1.964684 0.050315
C  3.548605 -1.307791 -2.186562
C  3.863772 2.36756 1.524538
H  -1.210348 0.389838 2.341328
H  -3.373607 -1.130419 -0.774538
H  0.686052 -1.267379 1.804623
H  -4.750082 1.568655 -1.305709
H  -4.170869 2.293792 0.234097
H  -3.569106 2.910061 -1.327925
H  -1.794882 1.577262 -2.663479
H  -1.437288 -0.111268 -2.198958
H  -3.057438 0.318961 -2.825426
H  1.158117 0.583225 -0.481747
H  4.432265 0.689002 -2.270796
H  2.666821 0.67995 -2.098662
H  4.413866 2.466566 -0.579993
H  2.660524 2.315404 -0.291643
H  -6.140591 -0.410682 1.102634
H  5.362181 -0.942168 -0.217762
H  5.265269 -0.02207 1.170086
H  2.719201 -1.849826 -1.696892
H  4.48902 -1.838868 -1.950081
H  3.401483 -1.386741 -3.278975
H  3.142404 1.864139 2.194551
H  3.733179 3.457779 1.648204
H  4.884259 2.117454 1.865832
