program: Gaussian 09
title: 000192061
version: EM64L-G09RevD.01
frameworkgroup: C1[X(C7H14N2O3)]
method: RPBEPBE
basis: SDD
operation: Freq
keyword: #p
keyword: freq=noraman
keyword: PBEPBE/SDD
title: #p freq=noraman PBEPBE/SDD
converged: YES YES NO NO
title: Mulliken charges:
elementType: O O O N N C C C C C C C H H H H H H H H H H H H H H
charge: -0.435869 -0.288136 -0.225204 -0.320181 -0.356688 -0.104167 -0.547222 -0.743580 0.229318 -0.336944 0.217931 -0.653136 0.243614 0.255537 0.254867 0.298494 0.238368 0.229957 0.237499 0.216733 0.258734 0.298780 0.233245 0.203232 0.221433 0.373384
chargesum: 0.00000
title: Mulliken charges with hydrogens summed into heavy atoms:
elementType: O O O N N C C C C C C C
charge: -0.062485 -0.288136 -0.225204 -0.021687 -0.057908 0.139447 -0.036817 -0.037757 0.229318 0.138524 0.217931 0.004774
polarizability: 1.25773239e+02 -8.11617719e+00 9.86398560e+01 -2.10568426e+00 -1.01440364e+00 7.60648948e+01
1716.lowfreq: -17.0850 -5.1868 -0.0005 0.0002 0.0005 4.5963 11.8614 34.8854 40.3210
frequency: -10.3065 34.8058 40.2303 48.4108 66.2671 111.0708 150.7196 199.5206 221.7246 236.9717 263.4822 282.9194 315.0250 336.1736 376.9655 441.9391 499.8830 539.2960 567.3731 587.8061 597.0543 615.6572 686.6288 714.8901 780.3343 787.1255 878.4348 890.5544 897.5087 988.2880 1020.7202 1038.0182 1063.6737 1096.0835 1114.8853 1135.6702 1142.6806 1170.2481 1217.6812 1243.1423 1255.6710 1278.0205 1312.3325 1322.2666 1343.3969 1352.9597 1388.1105 1392.1904 1442.5091 1467.8874 1468.2511 1473.0100 1473.7744 1481.0954 1483.0639 1496.4068 1618.7820 1676.1573 2936.5193 2981.3967 2987.7139 2990.7791 2999.4006 3054.1340 3064.4679 3084.1787 3096.1522 3101.5080 3106.1132 3469.6021 3501.7432 3534.9179
redmass: 2.9659 3.9212 5.1702 6.8479 4.2489 3.7759 3.1905 1.6191 1.0751 2.1179 3.5472 1.9352 2.4001 3.4830 3.2365 3.3020 3.4320 2.7516 2.0195 1.4654 1.9951 1.5234 3.2183 3.9267 1.7833 2.0007 2.1657 2.1915 3.0341 1.7003 2.9106 1.8016 3.4166 2.0264 2.5551 1.7070 1.7895 3.9459 2.0063 1.5290 1.2914 1.1473 1.3856 1.2936 1.7171 1.3417 1.2182 1.2306 1.0825 1.0925 1.0896 1.0627 1.0522 1.0973 1.1589 1.6856 6.3803 8.3866 1.0825 1.0362 1.0613 1.0663 1.0356 1.1007 1.0975 1.0973 1.1015 1.1013 1.0995 1.0744 1.0638 1.0770
irintensity: 0.3840 1.0958 2.5260 6.8226 1.6345 6.0932 3.4294 0.9880 0.7772 16.5844 7.5948 17.7562 2.8603 20.0994 4.3808 22.9493 23.0462 51.5896 18.6816 56.2381 34.6838 147.2782 75.4580 21.7804 12.4779 5.2263 0.5764 14.1571 2.8643 16.9226 103.5869 122.7126 9.3526 9.0654 17.9547 49.7723 2.7990 41.2545 89.8844 1.5158 3.1396 45.4971 3.3929 6.5045 22.5253 5.5353 16.5086 30.5911 17.2094 19.3747 52.0069 5.1141 6.7205 22.0777 0.2402 141.9401 157.9632 239.0552 35.8384 29.0739 34.5391 46.6883 13.9319 6.8037 10.3250 34.4885 34.7009 17.8441 21.5431 4.9177 12.8729 13.8481
temp: 298.150 k
press: 1.00000 atm
elementType: 8 8 8 7 7 6 6 6 6 6 6 6 1 1 1 1 1 1 1 1 1 1 1 1 1 1
symmnumber: 1
zpe: 562450.5 jmol-1
zpe.correction: 0.214226 hartree
zpe.thermalcorrener: 0.227705 hartree
zpe.thermalcorrenthalpy: 0.228649 hartree
zpe.thermalcorrgfe: 0.172703 hartree
zpe.sumelectzpe: -609.363650 hartree
zpe.sumelectthermal: -609.350171 hartree
zpe.sumelectthermalent: -609.349227 hartree
zpe.sumelectthermalfe: -609.405173 hartree
dipole: 3.5971 -3.2024 -0.1416
dipole: 4.8182
quadrupole: -77.1714 -67.3883 -71.5621
quadrupole: -5.0016 2.2008 0.5387
quadrupole: -5.1308 4.6523 0.4785 -5.0016 2.2008 0.5387
hfenergy: -609.577876 hartree
pointgroup: C01 [X(C7H14N2O3)]
dipole: -1.4929657 1.1401267 -0.2539771 debye
dipolederiv: -0.5322472 0.3229418 -0.0858012 0.4339048 -0.9039073 0.1997378 -0.0600063 0.197559 -0.4726141 -0.7156073 -0.0165835 -0.0806211 0.3467794 -0.9494788 0.0569433 -0.1083721 -0.05087 -0.3849714 -1.0930452 0.1194008 -0.0186403 -0.1909164 -0.564804 0.0662284 -0.0408358 0.0686538 -0.3040982 -0.7746149 0.0095856 -0.0999693 -0.0274868 -0.328445 -0.1762279 -0.0027203 -0.0472779 -0.5451727 -1.2313577 0.2824238 -0.1199795 0.1988993 -0.3929888 0.0818208 -0.226079 0.1389275 -0.5252288 0.3413788 -0.0068867 -0.1023265 0.119998 0.1513132 0.0208959 -0.0788898 0.0899289 0.4393976 0.4690443 -0.0548884 -0.0121709 -0.2839619 0.0915453 0.0273825 -0.0664646 -0.0571172 0.1391495 -0.0119144 0.0265451 0.0336385 0.0628412 -0.0514092 -0.0123773 0.0660736 -0.0112405 0.0367498 1.0908901 -0.289469 0.3661949 -0.6476623 1.0873437 -0.1381797 0.4620081 -0.0378038 0.2947665 0.5540008 0.0347147 0.0625742 0.30072 0.0632182 0.0474059 0.0982932 -0.0487224 0.3465002 1.4091248 -0.2248949 0.0990675 -0.1036944 1.1408824 -0.2872215 0.0536913 -0.349582 0.2666314 -0.1089839 0.0017706 0.0350637 -0.0287939 0.1181175 -0.0248581 0.0335515 0.0034804 -0.0137756 -0.0325163 -0.0023842 -0.1244857 0.0333944 0.0265149 0.0149618 -0.0458146 -0.0025392 -0.1236837 -0.0671013 0.0271486 0.0673913 0.003486 0.085502 -0.0273978 0.0751097 -0.0590455 -0.0864605 0.0715486 0.0111142 -0.0396604 0.0212162 -0.0498445 0.042181 -0.0774718 0.0864456 0.072774 0.1765975 -0.0639058 0.1451724 0.0498581 0.0492896 0.0968247 0.1265956 -0.0041502 0.2609253 0.0237838 -0.123557 0.0168392 -0.0969032 -0.0441613 0.0177857 0.0134895 0.0410671 0.094271 0.0216628 0.0464743 0.0937211 0.0268135 0.0951912 0.0000719 0.1114452 -0.0318567 -0.068519 0.0214233 0.0295512 -0.0921415 -0.0126201 0.0902055 -0.0326632 -0.1233198 0.022745 -0.0303946 -0.0574664 -0.0012984 -0.0253665 -0.0249826 0.0731818 0.1035955 -0.0723409 0.0701004 -0.1637286 0.0979582 0.0559615 0.0318982 -0.0373884 -0.0271696 -0.0541809 0.0258098 0.0011352 0.0996612 0.1929165 -0.0116749 -0.0744538 -0.0502958 0.0843456 -0.0354725 -0.1070605 -0.029754 0.2734397 0.0916253 0.0259957 -0.0327491 0.0176817 0.0572702 0.0835743 0.0230116 0.072443 -0.1145695 0.0738412 0.0094371 0.0237036 0.0742352 -0.1743462 -0.0368995 0.03508 -0.0093086 0.0783997 -0.1461225 -0.0621024 -0.0815046 -0.096165 0.0588865 -0.0543008 -0.0903907 -0.0587117 0.0497935 0.1351813 -0.1454197 0.0146058 -0.088957 0.2137471 0.0203694 -0.0243929 0.0054941 0.3807574 unknown
polarizability: 126.7553367|-6.004722|97.3671986|2.1421502|-3.0442049|76.3554541 unknown
InChI: InChI=1S/C7H14N2O3/c1-3-8-6(10)4-9-5(2)7(11)12/h5,8-9,11H,3-4H2,1-2H3
charge 0 multiplicity 1
26 atoms
O  2.095334 1.879567 -0.992544
O  -1.105648 -1.630947 0.052713
O  4.092397 0.789235 -0.539535
N  1.254456 -0.269373 0.884754
N  -2.221198 0.38805 -0.308388
C  1.935194 -0.472833 -0.424502
C  -0.023946 0.44433 0.844946
C  2.751074 -1.773947 -0.407189
C  -1.157326 -0.365295 0.152577
C  -3.433633 -0.205387 -0.901937
C  2.850831 0.738217 -0.649208
C  -4.69633 0.051173 -0.053819
H  1.202983 -0.510623 -1.261557
H  -0.344383 0.652125 1.88489
H  0.120592 1.418661 0.343919
H  1.16686 -1.166045 1.37933
H  2.067745 -2.63411 -0.29668
H  3.322158 -1.895985 -1.342508
H  3.473244 -1.764677 0.427472
H  -3.572783 0.191558 -1.926619
H  -3.232731 -1.287096 -0.984482
H  -2.174498 1.405478 -0.217931
H  -4.582289 -0.382074 0.955073
H  -4.902337 1.132794 0.053932
H  -5.577524 -0.413075 -0.533047
H  2.710762 2.658582 -1.075859
