program: Gaussian 09
title: 000192038
version: EM64L-G09RevD.01
frameworkgroup: C1[X(C18H15ClN2O2)]
method: RPBEPBE
basis: SDD
operation: Freq
keyword: #p
keyword: freq=noraman
keyword: PBEPBE/SDD
title: #p freq=noraman PBEPBE/SDD
converged: YES YES NO NO
title: Mulliken charges:
elementType: Cl O O N N C C C C C C C C C C C C C C C C C C H H H H H H H H H H H H H H H
charge: -0.031952 -0.404393 -0.239588 -0.244432 0.001618 -0.594827 0.524182 0.090297 0.434663 -0.620968 0.305181 -0.456191 -0.376303 -0.402907 -0.367485 -0.351564 0.224166 -0.241319 -0.217738 -0.231248 -0.264134 -0.239217 -0.231553 0.300709 0.271824 0.282406 0.282930 0.262426 0.237722 0.269181 0.257641 0.233607 0.231043 0.230184 0.229295 0.233598 0.231366 0.381777
chargesum: 0.00000
title: Mulliken charges with hydrogens summed into heavy atoms:
elementType: Cl O O N N C C C C C C C C C C C C C C C C C C
charge: -0.031952 -0.022616 -0.239588 -0.244432 0.001618 -0.022293 0.524182 0.090297 0.434663 -0.055632 0.305181 -0.456191 -0.113877 -0.165184 -0.098303 -0.093923 0.224166 -0.007712 0.013305 -0.001064 -0.034839 -0.005618 -0.000187
polarizability: 2.74761289e+02 -7.49113582e-01 2.40838090e+02 -1.28852179e+01 -6.48520831e+00 1.57023005e+02
1716.lowfreq: -5.7800 0.0013 0.0015 0.0017 0.4609 3.5338 19.4986 24.0222 34.3167
frequency: 19.3171 23.9501 34.2940 35.8336 47.3370 60.0305 64.4334 92.2936 115.7436 152.3686 170.2300 190.4820 222.0568 253.4808 278.6029 282.7056 309.0710 330.8700 359.6167 402.9467 409.3532 412.5513 459.9096 482.0488 489.2295 497.3566 562.7747 584.1102 592.6065 614.8382 616.1253 652.5662 663.4317 681.1874 695.7689 703.6912 704.4305 737.6941 772.7658 778.2264 792.4267 800.7921 854.6332 857.2267 859.8212 899.8988 915.6698 931.3112 978.5392 982.7866 985.0418 986.9902 989.7868 995.7501 999.7443 1002.3954 1026.6437 1032.3825 1059.9912 1083.7498 1086.9555 1106.4290 1173.8333 1174.3623 1187.4769 1190.1690 1193.9345 1195.1687 1217.2250 1231.7316 1266.0630 1269.9150 1306.6653 1316.4779 1342.9598 1349.8417 1358.7283 1375.2403 1384.8044 1399.6281 1431.4209 1434.6732 1443.1078 1445.5041 1481.3848 1492.8574 1514.8104 1554.4408 1583.6675 1594.3674 1615.1096 1615.8277 1657.2492 2983.3580 3010.6111 3059.8388 3082.8442 3118.7261 3126.4937 3127.4522 3135.2477 3138.7370 3147.0144 3149.4408 3159.5763 3166.4006 3171.0477 3509.5566
redmass: 5.5887 5.0960 8.9824 4.6885 5.6417 6.2798 6.0950 6.2152 7.3788 7.0101 5.3459 3.5850 5.4023 5.1802 6.4050 5.8566 6.9104 3.0085 4.6667 2.8370 2.9443 4.6163 2.6651 5.5133 3.9590 2.6279 4.4269 4.0315 5.2807 6.4080 6.4090 2.2784 2.7378 5.9525 6.3656 2.4213 1.8082 1.4268 2.2567 3.7384 5.5898 4.3713 1.2915 4.4288 1.2482 1.8628 1.7484 1.4150 1.6178 1.5287 1.9529 4.3231 5.5026 2.3744 1.3928 1.6582 2.2414 2.0786 2.6021 1.6194 1.6031 2.7066 1.0562 1.0547 1.5528 1.1610 1.2364 2.0779 3.6457 1.8859 2.9293 1.8825 1.4899 1.4937 2.2150 1.9069 1.8813 5.6092 5.5011 3.4378 1.1666 2.1816 2.1198 2.5457 1.7994 1.2867 4.2075 9.3593 6.0040 5.9644 6.0088 5.9229 8.1768 1.0668 1.0601 1.1018 1.0926 1.0876 1.0851 1.0861 1.0883 1.0912 1.0934 1.0959 1.0965 1.1015 1.1001 1.0640
irintensity: 0.4557 0.5765 0.6394 0.5313 0.4367 0.4860 1.5426 0.6967 0.8235 2.9960 0.8261 1.9711 0.2738 0.6085 2.8238 0.2125 2.7593 10.8412 0.7783 0.0857 0.7989 8.9371 6.4170 3.8298 22.2428 27.9974 0.9009 37.5861 13.0358 0.3594 0.1810 74.2458 47.3359 20.1370 11.9602 22.1302 46.1106 56.3884 31.8805 28.3808 13.6034 2.4753 1.2143 1.6304 0.3679 1.6282 1.2124 3.1663 4.3171 1.6426 2.8947 6.5508 0.4253 16.7277 1.9431 12.0423 8.5766 6.6076 370.2475 8.5257 6.5571 9.9513 0.1500 0.1901 13.7151 8.1335 0.7585 6.0380 31.5415 6.1104 13.0267 57.9708 12.3611 12.6021 68.2543 57.0225 15.5095 9.8798 34.0257 23.3805 35.6420 16.8643 6.5752 11.8397 17.9744 24.1040 8.4700 27.0757 0.5173 0.7584 8.4391 6.3754 173.9036 12.6158 10.1091 3.8096 0.0429 5.5968 1.8882 1.2645 3.1085 11.6266 23.5645 28.5192 20.8633 23.5577 17.7732 32.5691
temp: 298.150 k
press: 1.00000 atm
elementType: 17 8 8 7 7 6 6 6 6 6 6 6 6 6 6 6 6 6 6 6 6 6 6 1 1 1 1 1 1 1 1 1 1 1 1 1 1 1
symmnumber: 1
zpe: 757656.6 jmol-1
zpe.correction: 0.288576 hartree
zpe.thermalcorrener: 0.308649 hartree
zpe.thermalcorrenthalpy: 0.309593 hartree
zpe.thermalcorrgfe: 0.236175 hartree
zpe.sumelectzpe: -1413.323070 hartree
zpe.sumelectthermal: -1413.302998 hartree
zpe.sumelectthermalent: -1413.302053 hartree
zpe.sumelectthermalfe: -1413.375471 hartree
dipole: -1.4670 4.8279 -1.4220
dipole: 5.2424
quadrupole: -121.7314 -139.1599 -140.9212
quadrupole: -0.6728 1.4963 6.6352
quadrupole: 12.2061 -5.2224 -6.9837 -0.6728 1.4963 6.6352
hfenergy: -1413.6116463 hartree
pointgroup: C01 [X(C18H15Cl1N2O2)]
dipole: -0.3309288 -1.9311867 -0.6441816 debye
polarizability: 266.4946782|-14.7785501|248.2640008|16.3921955|3.215219|157.8637051 unknown
InChI: InChI=1S/C18H15ClN2O2/c19-17-15(11-16(22)23)21(12-13-7-3-1-4-8-13)18(20-17)14-9-5-2-6-10-14/h1-10,22H,11-12H2
charge 0 multiplicity 1
38 atoms
Cl 3.046599 2.704605 1.684194
O  4.863442 -0.692518 -1.114071
O  2.928682 -0.272562 -2.321566
N  0.405865 0.405384 -0.184757
N  0.422259 2.448168 0.809545
C  -0.000017 -0.73754 -1.025568
C  1.718613 0.612838 0.287384
C  -0.353859 1.536763 0.158982
C  -0.189055 -2.04573 -0.257951
C  2.854027 -0.356301 0.166537
C  -1.781296 1.756463 -0.130781
C  1.668159 1.876093 0.883599
C  -0.445479 -2.069372 1.13541
C  -0.134811 -3.271564 -0.968897
C  -2.213933 3.09214 -0.363957
C  -2.748598 0.712215 -0.133747
C  3.499493 -0.413199 -1.217091
C  -0.650663 -3.297933 1.804468
C  -0.345004 -4.498626 -0.302198
C  -3.570127 3.371177 -0.623875
C  -4.105498 0.99698 -0.400271
C  -0.604304 -4.515749 1.088639
C  -4.522156 2.323775 -0.652546
H  0.760634 -0.859642 -1.817267
H  -0.940054 -0.45295 -1.530232
H  2.526041 -1.387074 0.411735
H  3.63319 -0.089542 0.899107
H  -0.473278 -1.130175 1.700018
H  0.073609 -3.264851 -2.046254
H  -1.46978 3.893924 -0.330018
H  -2.460809 -0.314616 0.116977
H  -0.846022 -3.302517 2.882572
H  -0.300656 -5.438369 -0.863891
H  -3.886096 4.404502 -0.804512
H  -4.838706 0.182943 -0.394191
H  -0.763338 -5.467212 1.607812
H  -5.576146 2.541251 -0.857562
H  5.262073 -0.75528 -2.024974
