program: Gaussian 09
title: 000192014
version: EM64L-G09RevD.01
frameworkgroup: C1[X(C23H25N3O4)]
method: RPBEPBE
basis: SDD
operation: Freq
keyword: #p
keyword: freq=noraman
keyword: PBEPBE/SDD
title: #p freq=noraman PBEPBE/SDD
converged: YES YES NO NO
title: Mulliken charges:
elementType: O O O O N N N C C C C C C C C C C C C C C C C C C C C C C C H H H H H H H H H H H H H H H H H H H H H H H H H
charge: -0.302044 -0.302074 -0.310703 -0.309162 -0.233481 -0.380351 -0.380889 0.172322 0.171050 0.119650 0.121112 0.273974 0.277706 -0.470382 -0.468423 -0.650204 -0.440511 -0.415762 -0.366468 -0.429425 -0.246720 -0.238439 -0.250821 -0.242602 -0.243670 -0.243758 0.338484 0.337893 -0.607875 -0.607954 0.252159 0.230215 0.229451 0.250018 0.255482 0.267964 0.234607 0.334619 0.253133 0.231718 0.329683 0.229920 0.225487 0.224431 0.229486 0.227174 0.227439 0.324497 0.324392 0.226624 0.227261 0.270196 0.226601 0.227177 0.269792
chargesum: 0.00000
title: Mulliken charges with hydrogens summed into heavy atoms:
elementType: O O O O N N N C C C C C C C C C C C C C C C C C C C C C C C
charge: -0.302044 -0.302074 -0.310703 -0.309162 -0.233481 -0.055853 -0.056497 0.172322 0.171050 0.119650 0.121112 0.273974 0.277706 0.011992 0.011046 0.107849 -0.105892 -0.162630 -0.134750 -0.099741 -0.016801 -0.012952 -0.026390 -0.013116 -0.016496 -0.016319 0.338484 0.337893 0.116206 0.115617
polarizability: 3.62909642e+02 1.02075875e+00 2.71078981e+02 2.75050635e+01 2.26826054e+00 2.57665473e+02
1716.lowfreq: -6.2923 -4.7235 -0.0007 -0.0004 0.0003 1.2897 20.6403 22.9244 30.3642
frequency: 20.6367 22.8911 30.3394 36.0385 47.4288 51.8526 56.7452 67.5114 72.8403 75.6435 77.4512 89.4819 103.4502 107.1274 107.9786 126.2380 133.2514 151.2304 155.1600 165.0675 180.6662 212.6541 235.4888 249.8236 262.9811 267.4490 288.0733 302.5269 313.4347 330.7886 331.5426 346.4025 406.7822 411.2481 416.8294 446.7922 466.5159 507.0298 518.8116 536.9105 568.2082 569.2276 601.3270 612.0062 618.3387 620.0082 626.2989 631.9313 662.1225 672.2129 691.9441 699.1833 701.4744 712.6374 717.1465 734.4853 770.7338 777.7318 782.2429 833.5170 833.9627 857.3246 867.0979 869.9260 910.4627 918.2764 940.1501 942.8596 986.0811 986.3059 987.6506 989.3180 995.4152 1001.1976 1004.0023 1013.2354 1018.4728 1032.9903 1040.2136 1069.1405 1084.3567 1087.6510 1099.2702 1104.5532 1118.1445 1126.4926 1126.5921 1142.5512 1144.6721 1144.9373 1171.9467 1172.2789 1197.6836 1200.0730 1205.0121 1208.6800 1218.0506 1244.3727 1249.7471 1278.3686 1319.9978 1327.5348 1346.0866 1351.3907 1358.4553 1369.1734 1373.0016 1382.8706 1427.7265 1428.6579 1430.1933 1432.9137 1446.6381 1447.0532 1449.4550 1458.1089 1462.0551 1462.8018 1470.0524 1480.9974 1484.1038 1484.8906 1485.1959 1495.6740 1515.9904 1517.2335 1538.5638 1567.2117 1580.3296 1582.5771 1613.4861 1614.9593 1662.4692 1663.9072 2976.1683 2976.5418 2994.9976 3038.9749 3039.5766 3052.1490 3052.4233 3089.1021 3107.0566 3108.4205 3110.5368 3111.3726 3116.3696 3119.7832 3126.3211 3128.0086 3131.1509 3138.5342 3138.6357 3146.6907 3149.1950 3161.1637 3161.3168 3577.8621 3578.0337
redmass: 4.8963 4.8069 5.4986 3.6196 4.7557 4.5473 5.1091 4.2282 4.3166 4.2848 4.6117 4.4028 1.0919 1.2034 1.2061 4.2061 3.2436 5.2667 3.5036 4.1119 4.8926 5.0598 6.5881 5.0093 3.2427 3.0387 5.4758 3.9362 2.9330 4.2761 4.4157 4.3326 3.7039 2.9370 3.2247 5.8971 3.5041 3.7820 4.2219 4.7664 1.1229 1.1146 5.3800 6.3678 4.4842 5.5749 5.3821 5.2721 6.3443 5.3972 6.5764 11.5928 10.6001 2.1237 1.7672 3.2812 2.1027 3.7406 2.4996 5.0586 4.9346 2.9429 1.2791 1.2524 5.1511 4.5394 1.4122 1.4680 3.9853 2.3801 2.0686 1.4361 3.1553 2.5045 2.6713 1.4688 1.4716 2.0150 1.9893 1.8137 1.6818 1.6861 4.3616 4.4847 1.3217 1.2850 1.2829 3.2063 1.7455 1.7877 1.0545 1.0546 1.1457 1.1548 2.2053 2.1918 1.7944 1.4824 2.0061 1.8110 1.7045 1.4566 1.2564 1.2575 2.7734 4.8031 6.5661 4.1201 1.1677 1.1717 2.1206 2.2612 1.7892 1.2952 1.2235 1.6681 1.3329 1.2722 1.1150 2.4624 2.2710 1.0475 1.0469 1.1168 1.4092 1.4518 6.8420 6.7374 5.8732 6.2463 5.9744 5.8784 8.3172 8.4008 1.0356 1.0356 1.0406 1.0574 1.0573 1.1025 1.1025 1.0935 1.1073 1.1075 1.0978 1.0977 1.0857 1.0846 1.0878 1.0886 1.1003 1.0933 1.0930 1.0967 1.0962 1.1017 1.1017 1.0772 1.0772
irintensity: 0.2441 0.0556 0.1677 2.6980 5.2316 2.6002 3.3317 0.3135 1.6770 2.9263 1.7161 3.7635 0.8885 0.0599 0.3433 2.7227 4.0857 0.0789 1.8387 1.4083 3.9666 2.1408 0.9334 6.7046 3.4450 4.1705 9.5491 18.6929 2.9721 5.5682 5.0407 49.0551 2.4444 1.0578 3.5553 1.0777 2.1967 9.1269 2.2535 4.3680 125.0674 136.9804 0.9246 0.4689 5.9336 2.4449 13.1608 0.1556 0.2597 5.2081 8.5871 8.4897 23.6532 52.8644 39.0722 74.4094 23.7201 20.7118 24.1653 18.9936 18.5558 21.4367 0.3959 0.3522 180.4241 83.5904 5.0017 34.3766 9.1863 3.7830 0.6874 0.3860 6.5521 16.3247 0.9240 4.7568 14.8633 17.9799 0.2036 25.6928 6.7189 4.1165 300.5661 151.7451 1.2861 0.0208 0.2259 27.7222 19.5127 17.9482 0.0434 0.0458 1.5335 3.0697 441.8250 71.8644 0.0927 5.1077 24.4313 1.9833 5.8272 0.2538 11.8320 3.4715 8.0251 0.8491 6.2509 2.2274 33.8472 33.7575 0.1406 7.0242 11.8427 42.2796 0.9251 5.2297 56.7596 233.8264 27.1828 51.1586 42.8279 17.5507 16.9125 16.7631 239.9056 80.4170 0.4500 9.5700 2.6224 0.5013 45.5048 2.2896 220.3681 349.8839 121.0037 69.4560 47.2625 25.1696 27.7619 38.7048 39.1043 12.4657 5.2381 4.1117 4.3838 4.2309 7.1019 3.4686 10.1050 23.8423 10.5480 33.0899 45.7409 12.7250 2.2766 69.1496 38.4982 26.5464 41.3974
temp: 298.150 k
press: 1.00000 atm
elementType: 8 8 8 8 7 7 7 6 6 6 6 6 6 6 6 6 6 6 6 6 6 6 6 6 6 6 6 6 6 6 1 1 1 1 1 1 1 1 1 1 1 1 1 1 1 1 1 1 1 1 1 1 1 1 1
symmnumber: 1
zpe: 1156104.3 jmol-1
zpe.correction: 0.440337 hartree
zpe.thermalcorrener: 0.469958 hartree
zpe.thermalcorrenthalpy: 0.470903 hartree
zpe.thermalcorrgfe: 0.376665 hartree
zpe.sumelectzpe: -1354.459127 hartree
zpe.sumelectthermal: -1354.429506 hartree
zpe.sumelectthermalent: -1354.428561 hartree
zpe.sumelectthermalfe: -1354.522798 hartree
dipole: 0.1375 1.5202 -0.0343
dipole: 1.5268
quadrupole: -178.1037 -149.4103 -152.1058
quadrupole: -0.2238 -3.6973 0.3158
quadrupole: -18.2305 10.4630 7.7675 -0.2238 -3.6973 0.3158
hfenergy: -1354.899464 hartree
pointgroup: C01 [X(C23H25N3O4)]
dipole: 0.047045 0.5986853 -0.0132737 debye
polarizability: 359.7548183|2.1815456|271.1401182|32.7435646|2.6941214|260.7591599 unknown
InChI: InChI=1S/C23H25N3O4/c1-24-22(27)29-14-18-19(15-30-23(28)25-2)21(17-12-8-5-9-13-17)26(3)20(18)16-10-6-4-7-11-16/h4-13,24-25H,14-15H2,1-3H3
charge 0 multiplicity 1
55 atoms
O  -1.650493 2.628229 0.511719
O  1.605734 2.646987 -0.589645
O  -3.579258 1.474011 1.254476
O  3.532326 1.471305 -1.304267
N  0.026258 -1.668692 0.012935
N  -2.638814 3.264365 2.447221
N  2.58747 3.22591 -2.546359
C  -0.675678 0.471627 -0.280323
C  0.664789 0.497224 0.252932
C  -1.043035 -0.879063 -0.455999
C  1.071706 -0.836052 0.459052
C  -2.253142 -1.462539 -1.086401
C  2.282404 -1.361849 1.139645
C  -1.482064 1.679877 -0.651006
C  1.443282 1.730659 0.598653
C  0.083518 -3.138316 -0.051734
C  -3.551275 -1.087041 -0.640597
C  2.161296 -2.169081 2.307689
C  -2.146527 -2.383217 -2.168501
C  3.583596 -1.040477 0.666041
C  -4.702308 -1.626634 -1.25653
C  3.306572 -2.663034 2.968098
C  -3.299321 -2.925842 -2.775307
C  4.727681 -1.530406 1.335532
C  -4.585257 -2.551287 -2.319968
C  4.597377 -2.349028 2.480935
C  -2.704636 2.369672 1.401111
C  2.65742 2.36214 -1.474584
C  -3.626601 3.275901 3.527573
C  3.572114 3.206829 -3.629414
H  -2.479614 1.408809 -1.033627
H  -0.950247 2.319814 -1.372644
H  0.895809 2.381923 1.297757
H  2.442665 1.485654 0.994638
H  -0.929154 -3.553768 0.065461
H  0.728395 -3.521925 0.751296
H  0.498745 -3.481511 -1.016964
H  -3.651802 -0.370804 0.182215
H  1.165569 -2.378036 2.717912
H  -1.157133 -2.652522 -2.555821
H  3.689863 -0.39655 -0.213449
H  -5.692828 -1.324837 -0.897572
H  3.192407 -3.27938 3.867199
H  -3.194111 -3.629619 -3.608933
H  5.722755 -1.271414 0.956342
H  -5.481563 -2.970523 -2.791083
H  5.488028 -2.730451 2.993141
H  -1.878396 3.943941 2.431642
H  1.826867 3.905456 -2.547838
H  -4.185857 4.229975 3.555871
H  -3.147999 3.112608 4.511055
H  -4.338727 2.456215 3.341853
H  4.130899 4.159892 -3.686836
H  3.090947 3.01507 -4.6065
H  4.285252 2.393205 -3.422092
