program: Gaussian 09
title: 000192008
version: EM64L-G09RevD.01
frameworkgroup: C1[X(C17H25NO5)]
method: RPBEPBE
basis: SDD
operation: Freq
keyword: #p
keyword: freq=noraman
keyword: PBEPBE/SDD
title: #p freq=noraman PBEPBE/SDD
converged: YES YES NO NO
title: Mulliken charges:
elementType: O O O O O N C C C C C C C C C C C C C C C C C H H H H H H H H H H H H H H H H H H H H H H H H H
charge: -0.462012 -0.296368 -0.292610 -0.234821 -0.433456 -0.375073 -0.000847 -0.392000 -0.205234 -0.166904 -0.610960 0.150431 -0.728177 -0.719476 0.497817 0.226147 -0.374423 -0.384253 -0.355966 -0.394292 0.281429 -0.215076 -0.676796 0.247165 0.182990 0.216648 0.232381 0.295205 0.268024 0.248443 0.351359 0.218040 0.230049 0.195166 0.217693 0.198597 0.215659 0.368972 0.244317 0.251873 0.253168 0.220153 0.233790 0.236183 0.233895 0.230395 0.219559 0.353195
chargesum: 0.00000
title: Mulliken charges with hydrogens summed into heavy atoms:
elementType: O O O O O N C C C C C C C C C C C C C C C C C
charge: -0.093040 -0.296368 -0.292610 -0.234821 -0.080262 -0.023714 0.246319 0.007637 0.027146 0.128301 -0.094493 0.150431 -0.084922 -0.087527 0.497817 0.226147 -0.130106 -0.132380 -0.102798 -0.174139 0.281429 0.254898 0.007052
polarizability: 2.24250270e+02 -1.42598949e+01 1.86159303e+02 -1.46112639e+01 -8.69115055e+00 2.01721035e+02
1716.lowfreq: -18.5534 -8.9942 -5.9199 -0.0007 -0.0004 -0.0002 10.0898 19.4304 23.0738
frequency: -8.5848 18.6322 23.0558 33.3057 37.6198 46.6647 56.2171 66.8554 69.3802 82.7721 93.4037 117.2359 127.5710 156.8703 166.5099 181.2216 202.9978 227.1939 235.1431 250.2534 268.5069 309.6541 313.1203 331.5974 341.0677 352.3864 354.2771 376.1629 393.6937 407.1965 413.6154 418.7636 437.4336 472.4633 480.6090 488.1218 534.1075 563.2798 600.7097 615.0163 634.7455 666.2729 703.7331 709.9279 739.7169 778.3508 799.6760 804.9777 812.1228 817.0238 827.4478 834.9191 846.4997 887.5567 909.4471 919.3745 932.9237 941.3384 949.3205 962.2191 964.3271 978.7602 988.5739 1003.9588 1024.8465 1051.0327 1089.6299 1109.3869 1113.4523 1128.5856 1137.3151 1141.2001 1142.5878 1151.6446 1178.4843 1180.8206 1194.9963 1208.3116 1222.5111 1230.5924 1232.8492 1245.3684 1247.2609 1251.4581 1279.4987 1310.1360 1322.1372 1323.1578 1340.9188 1342.1817 1349.9321 1360.8010 1376.2173 1382.0370 1390.2931 1394.7720 1403.1688 1425.2168 1441.0636 1465.4188 1465.8651 1472.0493 1472.6112 1474.2826 1480.4112 1485.9819 1491.5561 1494.9058 1504.2781 1594.9301 1597.4188 1624.9753 1645.0171 2954.6273 2963.5530 2966.4811 2984.4536 2996.8370 3005.7786 3009.0766 3016.8839 3020.3692 3031.0620 3054.2248 3064.6199 3067.8638 3071.6500 3076.3401 3079.8755 3093.3088 3109.4391 3110.2758 3132.6046 3139.8011 3170.4081 3377.5805 3539.6694 3581.6333
redmass: 5.4103 5.0362 4.3104 3.8201 2.8543 4.4498 3.2016 6.3589 3.8546 3.5818 3.7261 3.6038 3.8492 3.4343 4.5635 2.9867 1.1678 1.5705 1.9416 1.6288 3.9915 4.8431 3.5419 3.5250 3.5581 1.8884 1.5052 3.9582 2.4031 2.8434 2.9636 2.3824 4.2671 2.1914 1.8093 2.2785 3.1149 3.8293 2.3987 1.6217 6.6460 4.1446 4.7817 3.9935 4.4982 3.3500 1.1190 3.4769 2.7672 1.8517 3.0795 2.0833 1.7906 3.6656 2.6342 1.1923 2.8178 1.4404 1.5616 1.7323 1.4591 2.2751 2.4449 2.7942 2.5542 3.9583 2.1853 1.8563 2.3050 2.2933 1.4740 1.7078 1.6235 1.8654 1.8008 1.1320 1.8511 1.3175 1.6846 1.3625 1.3713 1.7524 2.6266 1.1372 1.3205 1.6078 1.2712 1.2405 1.4067 1.3774 1.3707 1.4033 1.2222 1.3757 5.5881 1.2240 1.2664 2.7773 1.0960 1.0407 1.0531 1.1122 1.0481 1.0710 1.0599 1.0917 1.0802 1.9558 2.7023 6.4582 7.0298 6.3711 10.6753 1.0601 1.0362 1.0382 1.0830 1.0360 1.0836 1.0751 1.0583 1.0677 1.0997 1.0986 1.0979 1.0992 1.0987 1.1065 1.1038 1.0984 1.1034 1.0882 1.0901 1.0956 1.0955 1.0642 1.0778 1.0660
irintensity: 0.2242 1.5784 0.1950 0.1704 0.1943 1.3138 0.1359 4.0056 1.0594 0.7475 1.3531 2.6435 0.3480 2.3242 2.8027 1.4049 0.3749 0.6408 2.9159 1.1240 0.3132 12.5167 5.9968 21.4619 19.1449 39.6336 106.5985 5.8419 2.9062 8.3925 1.1788 8.4375 3.0550 63.6425 65.2599 2.2470 26.6247 3.8594 34.7347 112.1022 0.5355 13.2600 8.4456 0.8337 13.1933 30.4856 6.7767 6.9072 14.6111 9.2368 6.9256 8.8745 21.9120 25.9737 11.2574 5.8007 14.4568 1.5931 2.5517 5.2326 1.5790 17.7339 23.3437 2.1980 91.4465 78.9266 18.2702 74.7018 11.5576 5.6918 17.2889 95.9938 116.7677 155.9800 22.4344 7.4012 52.0180 4.4305 41.8865 6.7368 14.2424 69.2334 34.4389 1.1263 12.3713 36.6606 24.3856 1.4980 0.4746 9.9372 4.7998 0.8468 34.7989 159.6843 16.1690 28.7663 20.8049 12.3407 1.8060 13.9443 0.8039 22.1312 8.3158 3.1858 6.0711 2.6934 80.9959 246.0116 80.5880 43.4912 105.3467 42.2379 151.0498 24.9792 35.4011 29.4403 24.6568 14.7938 1.9417 7.4159 16.0258 16.2718 34.5237 12.5814 80.0320 37.4699 72.7489 3.9892 4.2774 26.8343 38.5983 18.9278 15.7315 6.9123 4.7820 65.2257 58.4402 38.7820
temp: 298.150 k
press: 1.00000 atm
elementType: 8 8 8 8 8 7 6 6 6 6 6 6 6 6 6 6 6 6 6 6 6 6 6 1 1 1 1 1 1 1 1 1 1 1 1 1 1 1 1 1 1 1 1 1 1 1 1 1
symmnumber: 1
zpe: 1038896.2 jmol-1
zpe.correction: 0.395695 hartree
zpe.thermalcorrener: 0.420361 hartree
zpe.thermalcorrenthalpy: 0.421305 hartree
zpe.thermalcorrgfe: 0.338703 hartree
zpe.sumelectzpe: -1091.924275 hartree
zpe.sumelectthermal: -1091.899608 hartree
zpe.sumelectthermalent: -1091.898664 hartree
zpe.sumelectthermalfe: -1091.981266 hartree
dipole: -2.7029 4.0606 3.9897
dipole: 6.3017
quadrupole: -131.6380 -143.1681 -142.6993
quadrupole: 3.4199 -4.1810 7.0920
quadrupole: 7.5305 -3.9997 -3.5308 3.4199 -4.1810 7.0920
hfenergy: -1092.3199693 hartree
pointgroup: C01[X(C17H25N1O5)]
dipole: 1.0236447 1.2521885 -1.8791105 debye
polarizability: 223.4898215|12.4938955|192.9590947|-17.6659372|10.2708946|195.6816916 unknown
InChI: InChI=1S/C17H25NO5/c1-4-23-17(22)14(10-12-5-7-13(19)8-6-12)18-16(21)15(20)9-11(2)3/h5-8,11,14-15,18-20H,4,9-10H2,1-3H3
charge 0 multiplicity 1
48 atoms
O  -3.368595 -2.061368 1.367298
O  0.452838 2.188327 -0.792875
O  -1.751954 -0.372992 2.635617
O  1.623108 3.22248 0.937402
O  4.538484 -2.502016 -1.782406
N  -0.720716 0.416939 0.707454
C  -4.689729 -0.982151 -1.093098
C  -3.643234 -0.208714 -0.248897
C  -2.650612 -1.140858 0.494397
C  0.247905 1.247292 1.435429
C  1.406482 0.407896 2.09172
C  -1.660921 -0.331312 1.361332
C  -4.041428 -1.713824 -2.29268
C  -5.795868 -0.015849 -1.576744
C  2.257359 -0.349433 1.087853
C  0.84324 2.330789 0.537294
C  1.884962 -1.648621 0.64874
C  3.435338 0.226221 0.546359
C  2.648876 -2.349446 -0.30562
C  4.214304 -0.462774 -0.409334
C  3.81479 -1.751879 -0.836975
C  1.038701 3.16456 -1.76862
C  0.448521 2.83616 -3.134881
H  -5.143496 -1.740191 -0.425194
H  -3.083287 0.487341 -0.910082
H  -4.165166 0.406338 0.510951
H  -2.081633 -1.748654 -0.23761
H  -0.281639 1.751169 2.267409
H  0.916511 -0.280876 2.802218
H  2.020469 1.11746 2.674569
H  -0.672425 0.430234 -0.313986
H  -4.808531 -2.243009 -2.887501
H  -3.302379 -2.468661 -1.967723
H  -3.530232 -0.996182 -2.965133
H  -6.299868 0.476958 -0.72455
H  -5.3738 0.776182 -2.226743
H  -6.565296 -0.554529 -2.160411
H  -3.169639 -1.759625 2.302429
H  0.993677 -2.125014 1.073747
H  3.752528 1.221072 0.881163
H  2.369612 -3.353555 -0.638081
H  5.128914 -0.003587 -0.807602
H  2.136879 3.049933 -1.738503
H  0.784345 4.182892 -1.425111
H  0.703854 1.807189 -3.440647
H  -0.649974 2.940362 -3.128386
H  0.855935 3.531885 -3.890715
H  5.350191 -2.01566 -2.071072
