program: Gaussian 09
title: 000191982
version: EM64L-G09RevD.01
frameworkgroup: C1[X(C19H23NO)]
method: RPBEPBE
basis: SDD
operation: Freq
keyword: #p
keyword: freq=noraman
keyword: PBEPBE/SDD
title: #p freq=noraman PBEPBE/SDD
converged: YES YES NO NO
title: Mulliken charges:
elementType: O N C C C C C C C C C C C C C C C C C C C H H H H H H H H H H H H H H H H H H H H H H H
charge: -0.278663 -0.099766 -0.061357 -0.093895 -0.588623 -0.560165 -0.707605 -0.706551 0.512541 0.514910 -0.072176 -0.423379 -0.437154 -0.397951 -0.389440 -0.229685 -0.228668 -0.231070 -0.235262 -0.240521 -0.242163 0.229737 0.279571 0.215218 0.230401 0.194490 0.224895 0.236514 0.205486 0.242555 0.231434 0.198262 0.247812 0.159909 0.233091 0.228489 0.228011 0.247327 0.227075 0.224200 0.226048 0.226889 0.230560 0.228668
chargesum: 0.00000
title: Mulliken charges with hydrogens summed into heavy atoms:
elementType: O N C C C C C C C C C C C C C C C C C C C
charge: -0.278663 -0.099766 0.168380 0.185677 -0.143004 -0.140780 -0.023050 -0.029044 0.512541 0.514910 0.087733 -0.190288 -0.208665 -0.169940 -0.142113 -0.002610 -0.004468 -0.005022 -0.008373 -0.009961 -0.013495
polarizability: 2.75504261e+02 -5.20254225e-01 2.17312184e+02 1.02941741e+01 -2.59346749e+01 1.33139737e+02
1716.lowfreq: -5.7295 0.0005 0.0006 0.0009 2.4610 7.7790 17.9478 24.8948 27.5944
frequency: 17.9009 24.8715 27.4556 35.6696 55.3627 58.9235 67.7986 87.9982 110.0598 164.2179 184.8608 206.6882 222.9375 239.6310 242.1542 249.8771 267.7752 314.8785 344.4536 356.0830 387.9756 403.2784 403.5362 425.9613 479.7362 486.3906 518.8290 532.9532 571.3019 606.1119 617.8223 618.1684 666.7666 705.6394 706.1294 738.1510 755.6115 774.8254 821.4570 826.9751 852.9997 855.1952 860.2368 886.7994 896.0802 907.1219 920.4363 924.5570 962.6287 975.7054 976.9192 987.3968 989.8615 990.2800 995.2913 995.9461 1026.6587 1027.0040 1034.9543 1051.1621 1058.5577 1097.3941 1099.6892 1117.3506 1133.5326 1157.2451 1172.2872 1172.9212 1188.2641 1188.5680 1201.8044 1212.2925 1216.7094 1219.0207 1245.4755 1296.2635 1306.4212 1316.1580 1327.3198 1335.1260 1351.1622 1356.3291 1382.0876 1382.6061 1389.8396 1390.9806 1394.7996 1416.5021 1440.7844 1441.3011 1464.4742 1470.3149 1473.0267 1475.7945 1479.5115 1482.9112 1484.0516 1484.3713 1592.5563 1592.9081 1611.3380 1613.7614 1615.4650 2941.6772 2972.8757 2980.4519 2989.2942 2994.6071 3020.3819 3022.6717 3039.1180 3055.5102 3075.1657 3086.7762 3094.4330 3096.4248 3109.8278 3113.9794 3117.2014 3117.2497 3132.2203 3132.4705 3144.0437 3144.4265 3162.6636 3163.4012
redmass: 4.8499 4.1043 3.7075 4.4664 3.3429 3.7867 4.2058 3.8878 4.8835 4.6990 4.2573 1.1764 1.5682 2.4455 2.0793 2.3029 4.8427 2.9562 2.2382 2.3786 2.4723 2.8103 2.8208 2.8597 3.7401 3.4900 3.1659 3.0575 5.0114 4.5939 6.2945 6.2390 3.9941 1.9521 1.7513 1.9239 1.9301 2.7715 3.6415 3.1374 1.3238 1.2603 2.0711 1.7588 1.4485 1.6093 1.4627 1.5314 1.6044 1.3930 1.3860 1.7819 6.0824 6.0764 1.3161 1.3402 2.1954 2.1982 1.7255 1.6282 1.8580 1.6828 1.6405 2.3672 2.2582 2.6585 1.0544 1.0548 1.1230 1.1211 1.8290 1.6028 2.6120 2.1760 1.6431 1.3834 1.5527 1.3266 1.2995 1.2521 1.3420 1.2691 6.8138 7.0408 1.2372 1.2321 1.2669 1.6971 2.1517 2.1519 1.1007 1.0786 1.0634 1.0899 1.1396 1.1260 2.1497 1.8237 6.0200 6.0236 6.0812 6.1447 6.1650 1.0849 1.0598 1.0385 1.0362 1.0593 1.0858 1.0840 1.0996 1.1021 1.0970 1.0990 1.1000 1.0999 1.0880 1.0872 1.0871 1.0873 1.0907 1.0901 1.0957 1.0955 1.1014 1.1014
irintensity: 0.0299 0.1152 0.0855 1.9659 0.3387 0.2966 1.2244 0.2016 1.3781 2.9551 4.2586 0.2622 0.3270 1.2287 0.9367 6.4442 2.7687 5.2782 0.8588 1.1834 2.1631 0.0167 0.0119 2.7519 1.1820 4.1806 28.7024 18.6022 7.9197 7.4712 0.0341 0.5313 4.0912 80.4098 5.4604 67.9557 15.0688 20.1396 0.8982 10.3624 0.3521 0.2435 1.3963 1.4835 1.5799 5.4675 1.6206 3.2685 1.4626 0.0614 0.0648 5.1265 0.0345 0.0714 0.1223 0.2525 8.1290 6.0587 6.9824 14.7706 3.5617 7.1327 2.1575 10.1294 44.4727 96.4676 0.0294 0.5354 0.9202 0.0768 71.0530 1.9954 1.4998 2.8754 59.4166 8.4060 13.1685 1.3620 1.8173 2.9631 8.9349 6.3797 0.7838 0.5923 8.6898 27.9444 34.9747 25.0420 8.7060 6.4130 2.1056 0.8206 5.7062 17.0867 22.7668 2.0591 18.7039 15.5135 1.7169 1.9415 264.2003 12.6133 102.0202 97.4338 49.1911 20.9076 21.5310 19.2558 12.0092 8.6753 12.9328 20.8777 36.0036 31.5345 31.8700 24.5751 16.7283 9.8993 6.3263 6.4662 10.7484 7.6520 35.2667 42.7053 27.4748 22.5577
temp: 298.150 k
press: 1.00000 atm
elementType: 8 7 6 6 6 6 6 6 6 6 6 6 6 6 6 6 6 6 6 6 6 1 1 1 1 1 1 1 1 1 1 1 1 1 1 1 1 1 1 1 1 1 1 1
symmnumber: 1
zpe: 974960.1 jmol-1
zpe.correction: 0.371343 hartree
zpe.thermalcorrener: 0.391863 hartree
zpe.thermalcorrenthalpy: 0.392807 hartree
zpe.thermalcorrgfe: 0.318869 hartree
zpe.sumelectzpe: -866.261498 hartree
zpe.sumelectthermal: -866.240978 hartree
zpe.sumelectthermalent: -866.240034 hartree
zpe.sumelectthermalfe: -866.313972 hartree
dipole: 2.3410 -3.2727 1.8395
dipole: 4.4243
quadrupole: -112.8712 -135.2513 -130.5618
quadrupole: 8.8694 -0.3097 0.7470
quadrupole: 13.3569 -9.0232 -4.3337 8.8694 -0.3097 0.7470
hfenergy: -866.632841 hartree
pointgroup: C01 [X(C19H23N1O1)]
dipole: 0.891294 -1.1806553 0.9173616 debye
polarizability: 275.0122474|1.1831254|208.4182125|12.8877503|-36.6920424|142.5257217 unknown
InChI: InChI=1S/C19H23NO/c1-16(13-18-9-5-3-6-10-18)20(15-21)17(2)14-19-11-7-4-8-12-19/h3-12,15-17H,13-14H2,1-2H3
charge 0 multiplicity 1
44 atoms
O  -0.920541 3.529807 -1.356603
N  0.042196 1.812696 -0.063765
C  1.300111 1.152846 0.399127
C  -1.286549 1.249814 0.316163
C  2.127171 0.595249 -0.808929
C  -1.51367 -0.138272 -0.363668
C  2.134866 2.073758 1.316503
C  -1.478944 1.207991 1.846312
C  3.231293 -0.359179 -0.378032
C  -2.943783 -0.638013 -0.215535
C  0.08804 2.924019 -0.884937
C  4.586102 0.056451 -0.319481
C  -3.259867 -1.738065 0.621194
C  2.917756 -1.692732 -0.003438
C  -3.999113 0.007634 -0.91342
C  5.600751 -0.831568 0.105408
C  -4.594432 -2.184638 0.760654
C  3.927147 -2.583824 0.422841
C  -5.333086 -0.43416 -0.776377
C  5.274098 -2.154965 0.480424
C  -5.636419 -1.532797 0.062471
H  0.980036 0.280169 0.997566
H  -2.01667 1.960768 -0.113635
H  2.557206 1.443553 -1.374601
H  1.420262 0.078428 -1.485321
H  -0.810838 -0.8803 0.065163
H  -1.263948 -0.024522 -1.436277
H  1.533368 2.406527 2.180144
H  2.484059 2.973123 0.777077
H  3.022291 1.535268 1.691784
H  -1.360989 2.216917 2.278391
H  -0.758667 0.528952 2.341256
H  -2.494096 0.845445 2.083269
H  1.125498 3.258547 -1.106235
H  4.84729 1.080473 -0.614358
H  -2.455417 -2.249858 1.164567
H  1.877492 -2.039346 -0.062313
H  -3.771242 0.855529 -1.571846
H  6.642719 -0.493801 0.139695
H  -4.819745 -3.038714 1.40956
H  3.667566 -3.611366 0.701964
H  -6.134579 0.07398 -1.324519
H  6.059351 -2.845871 0.806782
H  -6.671174 -1.877751 0.167175
