program: Gaussian 09
title: 000191975
version: EM64L-G09RevD.01
frameworkgroup: C1[X(C19H31NO2)]
method: RPBEPBE
basis: SDD
operation: Freq
keyword: #p
keyword: freq=noraman
keyword: PBEPBE/SDD
title: #p freq=noraman PBEPBE/SDD
converged: NO YES NO NO
title: Mulliken charges:
elementType: O O N C C C C C C C C C C C C C C C C C C C H H H H H H H H H H H H H H H H H H H H H H H H H H H H H H H
charge: -0.325219 -0.463198 -0.106359 0.498840 -0.507638 -0.494967 -0.430629 -0.442430 -0.071606 -0.699951 -0.395322 0.511048 -0.227296 -0.461357 -0.406889 -0.397608 -0.336885 -0.243459 -0.246978 -0.243937 -0.621277 -0.614989 0.203490 0.222741 0.190218 0.233586 0.196557 0.204769 0.245693 0.196325 0.204836 0.231728 0.211867 0.191224 0.220816 0.213436 0.182136 0.328451 0.217180 0.197207 0.231218 0.233569 0.186310 0.223371 0.224023 0.223854 0.227907 0.226813 0.188214 0.221923 0.240219 0.189488 0.218940
chargesum: 0.00000
title: Mulliken charges with hydrogens summed into heavy atoms:
elementType: O O N C C C C C C C C C C C C C C C C C C C
charge: -0.325219 -0.134747 -0.106359 0.498840 -0.081408 -0.071163 -0.029303 -0.000412 0.133230 -0.256356 0.016718 0.511048 0.168277 -0.046970 -0.175672 -0.164039 0.072795 -0.019436 -0.023123 -0.016030 0.015673 0.033657
polarizability: 2.69610867e+02 9.28864607e+00 1.84173576e+02 5.27726729e+00 -9.40594981e+00 1.94431820e+02
1716.lowfreq: -14.0342 0.0005 0.0007 0.0009 7.1360 10.2180 19.5072 26.7385 37.5288
frequency: 17.1961 25.4489 37.4132 46.6995 53.2353 76.3813 77.7236 93.1440 112.3434 140.4726 149.7021 165.3858 193.1500 203.7078 219.5836 226.9179 234.0325 251.1594 292.5845 303.3090 311.9329 318.3230 330.0235 350.3776 365.3943 372.4710 404.1944 408.1377 412.0373 424.7542 447.9825 476.4013 490.9253 527.7911 540.7721 584.3833 618.9640 619.9174 683.3182 705.9335 738.1963 748.1341 765.4297 810.8649 827.5329 837.2496 847.7596 854.6890 860.4065 882.4119 891.2561 902.4741 920.6803 938.9658 957.0575 975.5539 985.8320 990.5968 992.6119 998.0100 1017.2959 1028.9468 1032.7882 1037.1593 1044.7394 1050.0583 1050.4687 1068.3080 1074.8943 1083.6300 1095.2238 1108.7193 1125.6286 1134.5245 1148.0155 1165.4000 1171.7383 1181.8762 1190.1582 1202.8681 1203.8820 1209.0790 1218.6886 1241.0951 1253.0196 1257.3285 1267.0413 1268.6686 1290.4894 1296.0194 1308.6739 1312.7500 1328.5932 1331.6843 1340.9607 1350.9606 1354.6900 1361.3816 1367.5614 1376.3680 1382.4584 1382.9688 1405.2344 1413.8336 1436.0754 1439.4892 1448.9599 1454.1101 1460.2509 1462.1566 1465.3805 1465.6039 1472.4418 1473.9593 1474.9635 1476.5453 1478.3869 1481.2688 1484.7681 1486.1944 1590.5304 1612.7464 2836.4383 2845.4244 2863.6343 2950.5085 2960.7498 2970.8176 2971.7080 2973.2389 2982.7659 2983.6867 2992.2911 2994.2608 3013.3893 3017.1037 3018.2908 3026.1508 3026.6448 3031.3081 3034.6271 3043.3000 3046.4291 3053.0891 3054.7089 3077.0032 3083.1843 3116.7932 3118.2373 3133.0661 3143.0537 3161.6862 3548.0601
redmass: 3.4903 3.8243 3.4020 3.5535 4.7180 3.8939 3.7944 3.6889 2.7877 2.9358 2.4960 2.3309 2.3087 4.1273 3.1317 1.2140 1.2801 2.8917 2.9689 1.6544 2.1875 1.7382 2.7001 2.2218 2.3637 2.4578 2.4276 2.6293 2.0546 2.1042 2.5581 3.4349 3.0882 2.5757 2.7736 3.7615 5.5124 3.6688 2.8099 1.8066 1.8658 2.2172 1.9727 2.8537 2.4721 1.8939 2.1540 1.2523 2.0896 2.3408 2.3607 2.4142 1.5524 1.9865 2.6608 1.3876 3.3091 6.2653 1.3098 2.1380 2.1577 2.1817 1.5641 2.6843 2.0384 1.9038 2.3022 1.7744 1.7185 1.2808 1.6759 2.3095 1.7376 1.4653 1.6234 1.6371 1.0564 1.4240 1.1317 1.4011 1.3332 1.3935 2.1412 1.3805 1.2843 1.8260 1.9188 1.3489 1.2710 1.3821 1.2381 1.4206 1.2749 1.2745 1.4029 1.4276 1.4339 1.4394 1.3790 1.4247 2.8279 1.8353 1.5667 1.1416 1.1588 2.1219 1.0746 1.0937 1.0712 1.0817 1.0864 1.0848 1.0759 1.0975 1.0868 1.0862 1.0843 1.2429 1.6850 1.0595 5.9641 6.1386 1.0702 1.0573 1.0577 1.0574 1.0610 1.0787 1.0596 1.0617 1.0674 1.0587 1.0628 1.0618 1.0991 1.1006 1.0730 1.0753 1.0977 1.0991 1.0892 1.1014 1.1016 1.0978 1.1009 1.1008 1.1003 1.0849 1.0876 1.0914 1.0961 1.1015 1.0658
irintensity: 0.0957 0.1448 0.3241 0.3873 0.6322 0.0408 0.1537 0.3391 1.1829 0.8278 0.8962 0.6148 1.7324 6.6545 1.0617 0.4421 0.4886 2.0652 1.0168 50.2655 6.7135 82.6969 20.6537 8.2976 1.7173 5.6737 3.4174 1.0066 0.6132 2.9312 1.7761 5.8310 6.3723 1.0060 11.1077 1.2962 1.1748 6.9024 12.0228 49.1748 12.3319 18.6243 29.2685 2.7082 1.9042 3.4972 19.8310 0.4556 1.2475 13.8299 0.9715 1.0487 1.5722 3.8884 116.9282 0.8930 73.8695 0.1997 0.0582 39.0374 40.1677 12.4103 12.0579 10.1970 30.4458 11.2734 11.9111 28.5906 6.1711 3.6276 10.7719 22.8072 23.5538 6.5355 9.2579 10.2249 0.2680 3.7518 1.5633 0.9293 13.4156 4.9737 2.5575 2.1704 26.3304 3.3523 10.1184 14.3028 13.5491 0.3474 0.6164 15.1652 4.1386 6.8046 2.8846 4.4255 0.8154 2.6718 7.1754 3.5520 2.8963 5.6219 7.6259 1.8967 6.9230 8.2498 5.8111 0.8160 14.5203 3.8867 14.8814 17.4285 2.7116 8.9995 23.9941 10.5152 6.0263 33.5319 9.4935 11.8510 1.4710 14.0825 60.4486 88.2361 303.2285 26.1493 36.2801 22.1912 21.9767 53.9377 34.9902 46.4671 39.2648 37.7047 19.4559 53.9436 30.4814 34.8494 21.7679 30.4217 14.4465 18.2907 41.4858 58.3254 63.2978 34.3628 42.7776 10.9075 2.3684 15.9722 45.3051 24.4729 4.1269
temp: 298.150 k
press: 1.00000 atm
elementType: 8 8 7 6 6 6 6 6 6 6 6 6 6 6 6 6 6 6 6 6 6 6 1 1 1 1 1 1 1 1 1 1 1 1 1 1 1 1 1 1 1 1 1 1 1 1 1 1 1 1 1 1 1
symmnumber: 1
zpe: 1222049.3 jmol-1
zpe.correction: 0.465454 hartree
zpe.thermalcorrener: 0.488881 hartree
zpe.thermalcorrenthalpy: 0.489825 hartree
zpe.thermalcorrgfe: 0.411518 hartree
zpe.sumelectzpe: -946.040508 hartree
zpe.sumelectthermal: -946.017081 hartree
zpe.sumelectthermalent: -946.016137 hartree
zpe.sumelectthermalfe: -946.094444 hartree
dipole: -0.4079 -2.3241 -0.7026
dipole: 2.4620
quadrupole: -125.6759 -142.8326 -129.0041
quadrupole: 8.3303 2.8908 -7.2319
quadrupole: 6.8283 -10.3284 3.5001 8.3303 2.8908 -7.2319
hfenergy: -946.505962 hartree
pointgroup: C01 [X(C19H31N1O2)]
dipole: 0.1444602 -0.900928 0.3250966 debye
polarizability: 269.3032363|-10.7136333|185.6833888|5.1284368|9.9107679|193.2296386 unknown
InChI: InChI=1S/C19H31NO2/c1-20(2)14-7-15-22-19(12-6-10-18(21)11-13-19)16-17-8-4-3-5-9-17/h3-5,8-9,18,21H,6-7,10-16H2,1-2H3
charge 0 multiplicity 1
53 atoms
O  0.803591 -0.487295 0.989909
O  2.075012 3.74121 0.044932
N  4.17003 -1.091998 -0.429402
C  -0.458569 -0.108916 0.289447
C  -0.816402 1.291638 0.852959
C  -0.296065 -0.095369 -1.258084
C  0.338522 2.300751 1.082686
C  0.892247 0.702887 -1.843546
C  1.438955 2.397357 -0.000604
C  -1.574403 -1.143524 0.702444
C  0.968788 2.197611 -1.449331
C  -3.000005 -0.798278 0.292672
C  1.388883 -1.797289 0.654347
C  2.692113 -1.933765 1.450841
C  -3.873456 -0.120209 1.183956
C  -3.5063 -1.169543 -0.982061
C  3.799861 -0.956605 1.002098
C  -5.198185 0.198022 0.809377
C  -4.829747 -0.85434 -1.36242
C  -5.681518 -0.164078 -0.469027
C  4.840959 -2.370807 -0.739656
C  4.960801 0.063187 -0.906283
H  -1.321578 1.157427 1.828812
H  -1.571065 1.733723 0.176419
H  -0.221737 -1.141165 -1.62191
H  -1.241615 0.304991 -1.673557
H  0.825989 2.068639 2.049562
H  -0.118479 3.307644 1.175272
H  1.844175 0.212032 -1.558491
H  0.821408 0.630851 -2.947598
H  2.211012 1.629894 0.213165
H  -1.511428 -1.241187 1.803243
H  -1.308565 -2.126007 0.266396
H  -0.000805 2.707291 -1.618569
H  1.711751 2.701336 -2.096376
H  1.60695 -1.859187 -0.430098
H  0.693545 -2.615647 0.936212
H  2.339556 3.930542 0.981692
H  2.477144 -1.748477 2.52092
H  3.042392 -2.981798 1.372916
H  -3.514425 0.152467 2.183921
H  -2.860697 -1.719654 -1.677659
H  4.692164 -1.090872 1.668744
H  3.429823 0.073395 1.154418
H  -5.853495 0.720721 1.515583
H  -5.198711 -1.153037 -2.350393
H  -6.70947 0.078574 -0.760897
H  4.186349 -3.223212 -0.489682
H  5.806797 -2.503731 -0.186854
H  5.057532 -2.419826 -1.821848
H  4.397518 0.998201 -0.738028
H  5.953563 0.160455 -0.397076
H  5.144697 -0.034029 -1.991594
