program: Gaussian 09
title: 000191972
version: EM64L-G09RevD.01
frameworkgroup: C1[X(C15H14IN3O)]
method: RPBEPBE
basis: SDD
operation: Freq
keyword: #p
keyword: freq=noraman
keyword: PBEPBE/SDD
title: #p freq=noraman PBEPBE/SDD
converged: YES YES NO NO
title: Mulliken charges:
elementType: I O N N N C C C C C C C C C C C C C C C H H H H H H H H H H H H H H
charge: 0.072047 -0.273445 -0.058912 -0.686302 -0.688655 0.326688 0.324086 0.271154 -0.112859 0.070823 -0.523308 -0.364166 -0.327122 0.308854 -0.750047 0.696476 -0.361025 -0.481237 -0.240724 -0.686225 0.210581 0.187649 0.264489 0.249583 0.220706 0.328989 0.320661 0.208164 0.208014 0.307983 0.307270 0.207545 0.231141 0.231125
chargesum: 0.00000
title: Mulliken charges with hydrogens summed into heavy atoms:
elementType: I O N N N C C C C C C C C C C C C C C C
charge: 0.072047 -0.273445 -0.058912 -0.036653 -0.073402 0.326688 0.324086 0.271154 -0.112859 0.070823 -0.312727 -0.176517 -0.062633 0.308854 -0.750047 0.696476 -0.111442 -0.260531 0.175453 -0.016414
polarizability: 4.13555077e+02 -3.02879341e+01 2.57969801e+02 -9.11375687e-02 2.63310837e-03 8.67402872e+01
1716.lowfreq: -6.3572 -0.0008 -0.0005 -0.0001 4.2113 5.0022 31.9241 44.0924 70.4513
frequency: 31.9239 44.0832 70.4440 75.1318 96.4953 105.7794 121.0283 139.3241 180.2836 209.9018 229.5474 243.6164 262.6478 274.4543 284.9808 305.4550 346.1210 366.6357 368.6954 396.5683 409.3033 413.1021 436.0251 436.7320 484.9925 489.1369 518.9664 528.0160 558.9591 572.2472 585.6076 640.6154 668.8756 669.1811 719.9547 738.4827 743.3131 773.1589 777.6877 801.2569 820.8756 838.4569 847.8763 851.1882 872.7078 919.8785 954.4892 967.0762 972.3323 1038.4683 1073.6664 1095.1406 1116.2160 1124.1170 1135.8174 1146.8254 1170.6566 1202.1640 1231.4737 1256.9398 1265.4759 1308.7858 1319.9731 1337.6908 1367.4348 1370.6128 1397.4815 1399.1613 1417.8374 1460.8819 1463.7689 1476.7082 1481.9756 1487.9007 1492.2843 1515.7614 1541.1081 1562.6820 1613.4235 1629.3284 1641.6952 1650.2752 2955.5811 2996.6787 3014.1564 3094.1858 3105.3511 3108.0923 3129.9159 3138.9168 3151.1204 3172.7365 3521.1512 3581.3638 3683.7127 3714.5820
redmass: 4.3456 4.7288 4.6796 7.2277 2.4251 2.7578 5.2599 3.3848 5.3274 9.0317 4.7633 1.1758 4.9285 4.2037 4.5145 3.6740 1.1947 1.1791 3.8872 3.5818 1.6276 4.0617 2.7982 6.1782 1.1594 4.2871 2.9452 6.0998 5.2419 3.1525 5.8304 4.9231 4.2707 6.7025 6.6635 4.7155 2.7685 6.7035 2.1301 2.2997 1.4974 1.3291 2.4223 4.3205 3.6168 1.3903 2.4639 1.3376 2.5674 2.8254 2.3716 2.7772 2.2294 1.8656 1.4347 1.5469 1.7464 2.4426 1.8039 2.1377 1.1402 5.5066 2.4181 2.6970 2.5746 1.5485 4.4433 1.3134 4.9141 1.0401 5.1742 1.3653 1.8296 4.3569 1.2404 5.2789 7.1745 6.4245 1.4807 3.7168 2.8554 1.5229 1.0553 1.0361 1.1076 1.0989 1.1014 1.0856 1.0899 1.0970 1.0868 1.0970 1.0477 1.0451 1.1012 1.1028
irintensity: 1.3203 0.1365 1.0197 0.6277 12.1130 0.2186 1.2687 8.2967 3.0015 0.9646 0.7547 0.6877 0.7560 1.6046 0.0276 4.1532 20.5227 117.3801 0.8298 50.4789 130.4339 0.9895 36.2884 2.7254 139.2995 2.8157 15.9997 1.2823 8.3484 19.5247 23.9680 0.1244 1.4691 7.7264 37.7943 6.0318 1.2011 0.4350 71.9968 7.0175 46.0578 21.3992 11.9256 19.0923 6.6318 0.1955 64.7731 0.9814 0.6453 103.8526 36.7348 87.7243 4.1438 8.0542 4.4059 6.9865 55.2594 320.1193 2.4912 121.0343 0.0436 29.5429 16.0152 19.1277 37.7188 17.2376 36.0593 47.5394 63.5633 11.9127 42.2628 197.4165 170.6108 87.7766 4.5901 41.4830 76.1219 119.7556 26.8204 67.6369 414.6423 403.1888 53.7640 33.6397 36.4163 31.6886 36.1851 8.0509 16.4961 39.3589 5.8230 16.4943 93.3234 61.6916 46.1826 22.7275
temp: 298.150 k
press: 1.00000 atm
elementType: 53 8 7 7 7 6 6 6 6 6 6 6 6 6 6 6 6 6 6 6 1 1 1 1 1 1 1 1 1 1 1 1 1 1
symmnumber: 1
zpe: 683814.7 jmol-1
zpe.correction: 0.260451 hartree
zpe.thermalcorrener: 0.279071 hartree
zpe.thermalcorrenthalpy: 0.280015 hartree
zpe.thermalcorrgfe: 0.212694 hartree
zpe.sumelectzpe: -829.589408 hartree
zpe.sumelectthermal: -829.570789 hartree
zpe.sumelectthermalent: -829.569845 hartree
zpe.sumelectthermalfe: -829.637165 hartree
dipole: 1.4463 4.1155 0.0128
dipole: 4.3623
quadrupole: -92.6324 -104.1751 -139.4881
quadrupole: -14.8671 0.0090 -0.0078
quadrupole: 19.4661 7.9234 -27.3896 -14.8671 0.0090 -0.0078
hfenergy: -829.8498595 hartree
pointgroup: C01 [X(C15H14I1N3O1)]
dipole: 0.2045724 -1.7037242 -0.0309915 debye
polarizability: 418.7573432|-5.331811|252.4341837|-10.1717613|2.0613232|87.0736383 unknown
InChI: InChI=1S/C15H14IN3O/c1-2-20-8-3-6-12-10(7-8)14(18)9-4-5-11(17)13(16)15(9)19-12/h3-7H,2,17-18H2,1H3
charge 0 multiplicity 1
34 atoms
I  -3.58087 2.996598 0.078277
O  4.490546 -0.438697 -0.20539
N  -0.861893 1.322524 -0.026892
N  -0.016227 -2.868875 -0.09636
N  -5.659324 0.427615 0.110521
C  0.78396 -0.556493 -0.096046
C  -1.645283 -1.03544 -0.029426
C  -0.294651 -1.51271 -0.074154
C  0.427483 0.851487 -0.071159
C  -1.876302 0.411669 -0.005695
C  2.163912 -0.927849 -0.140833
C  -2.781082 -1.912733 -0.006654
C  1.488664 1.817938 -0.0933
C  3.169483 0.043608 -0.161214
C  -3.240532 0.873409 0.041819
C  -4.341284 -0.003237 0.064553
C  2.827641 1.438478 -0.136985
C  -4.076618 -1.426285 0.038324
C  5.58999 0.545665 -0.235957
C  6.890958 -0.251431 -0.286092
H  2.492866 -1.972998 -0.161216
H  -2.649905 -3.001399 -0.025392
H  1.195106 2.871785 -0.073737
H  3.607459 2.205525 -0.152157
H  -4.928933 -2.115814 0.05464
H  0.941469 -3.202971 -0.128875
H  -0.756506 -3.562181 -0.079326
H  5.483466 1.194441 -1.12964
H  5.545176 1.181844 0.671895
H  -5.867362 1.425243 0.128002
H  -6.423727 -0.240775 0.123376
H  7.756568 0.435295 -0.311468
H  6.984197 -0.900132 0.601545
H  6.922358 -0.888406 -1.186484
