program: Gaussian 09
title: 000191963
version: EM64L-G09RevD.01
frameworkgroup: C1[X(C14H20Cl2N7O4P)]
method: RPBEPBE
basis: SDD
operation: Freq
keyword: #p
keyword: freq=noraman
keyword: PBEPBE/SDD
title: #p freq=noraman PBEPBE/SDD
converged: YES YES NO NO
title: Mulliken charges:
elementType: Cl Cl P O O O O N N N N N N N C C C C C C C C C C C C C C H H H H H H H H H H H H H H H H H H H H
charge: -0.055829 -0.053647 1.327246 -0.271835 -0.650709 -0.484419 -0.585873 -0.156621 -0.840751 -0.540416 -0.089154 -0.045822 -0.064185 -0.610945 -0.142806 -0.093506 0.386705 -0.389120 -0.384776 0.161453 -0.283113 -0.306664 -0.189182 -0.103417 -0.580334 -0.562764 0.167911 -0.364149 0.235710 0.262521 0.326015 0.377919 0.241134 0.251687 0.255547 0.248549 0.290835 0.236459 0.270575 0.265684 0.306707 0.264338 0.288632 0.393718 0.371814 0.243143 0.332299 0.343435
chargesum: 0.00000
title: Mulliken charges with hydrogens summed into heavy atoms:
elementType: Cl Cl P O O O O N N N N N N N C C C C C C C C C C C C C C
charge: -0.055829 -0.053647 1.327246 -0.271835 -0.256991 -0.112605 -0.585873 -0.156621 -0.462832 -0.540416 -0.089154 -0.045822 -0.064185 0.064789 0.092904 0.169015 0.386705 -0.063105 0.108045 0.161453 0.220983 0.220630 0.081394 -0.103417 -0.007943 -0.009793 0.167911 -0.121006
polarizability: 3.59850622e+02 1.34565627e+01 2.10924570e+02 2.11500265e+01 -1.84781510e+01 2.19346082e+02
1716.lowfreq: -5.5020 -3.2845 0.0012 0.0022 0.0025 2.2097 7.6795 14.1891 22.2153
frequency: 7.3789 14.1392 22.0767 28.1988 33.3980 35.5024 48.5483 69.4335 73.6866 89.8692 93.5596 102.4134 107.4301 133.4671 145.4874 161.0335 169.6655 193.1523 198.0586 210.2602 212.5997 213.9786 218.6868 249.6888 258.3218 264.7382 269.5009 285.6988 290.6293 312.7725 327.9126 345.2544 373.6894 374.2349 407.2858 430.2363 461.7499 497.4096 508.8965 509.7422 544.5246 547.6044 564.4946 595.6266 620.0344 640.5770 648.3651 670.3778 676.1619 686.5454 687.6999 695.8432 710.6202 746.1674 748.5459 775.1861 775.9252 780.9865 794.2490 805.1909 829.4076 834.3171 846.9352 850.5702 868.3002 929.3658 929.5900 952.8411 958.7793 986.5716 992.4011 1002.0452 1007.5451 1016.5498 1036.6586 1046.2463 1046.5098 1057.9162 1074.7270 1083.0124 1113.4714 1133.5602 1137.9262 1171.7121 1202.4548 1212.6840 1224.9899 1235.8319 1236.5276 1257.9929 1258.1745 1263.7133 1266.5753 1272.0773 1292.6271 1302.8071 1312.7255 1313.8530 1330.5674 1334.3440 1353.6686 1357.4528 1360.7967 1363.7728 1382.8771 1402.8086 1425.8193 1450.6754 1453.2060 1460.1281 1460.5834 1468.9280 1471.1889 1473.5476 1543.9003 1578.2169 1631.9690 1683.0173 2947.8151 3003.9450 3017.8637 3025.6520 3030.4791 3056.6100 3059.3349 3069.0671 3106.1409 3108.3750 3144.8443 3145.9471 3165.9746 3213.2285 3240.3230 3390.5558 3540.9320 3592.9156 3600.8071 3696.3592
redmass: 11.3602 10.4991 7.0192 9.0409 8.8624 12.0305 5.8386 7.4402 5.7007 6.7957 4.0965 2.4301 2.7092 5.9828 3.6190 6.0325 5.8434 4.8734 5.6292 6.9117 5.7052 5.0611 4.0491 2.2398 3.1434 2.4871 5.1047 2.8168 4.0497 4.1937 1.9680 2.6997 5.7821 3.3045 6.6829 4.7095 5.3446 6.7558 6.5890 1.2899 1.0520 4.3522 4.0869 4.0297 8.7628 6.8407 4.9301 8.0394 4.0091 7.1410 6.2232 5.4607 3.2309 5.2624 1.5044 2.0139 1.5754 1.2276 4.9053 4.8553 1.7579 2.2837 3.7044 4.0964 3.3526 1.4372 6.3613 2.8954 2.5127 3.5410 2.0603 1.5195 1.9200 3.1654 2.8251 2.4321 2.5041 2.1460 2.0987 2.3232 1.7711 4.3826 1.4236 1.8777 2.0573 2.8441 1.3096 1.6158 1.7913 1.3390 1.3916 1.3177 1.2485 4.0765 1.1415 5.6646 2.5293 1.6857 1.2226 1.4911 1.2197 2.2555 1.3327 1.2590 3.7317 1.5067 3.1912 1.5015 1.1079 1.3894 2.1747 1.0992 1.1062 1.0764 7.9623 1.8735 2.7688 7.5215 1.0834 1.0617 1.0857 1.0603 1.0641 1.0571 1.0567 1.1024 1.1018 1.1081 1.1117 1.1129 1.0921 1.0973 1.0981 1.0775 1.0442 1.0660 1.0670 1.1056
irintensity: 0.2448 0.0172 0.3978 0.9226 0.7558 0.6952 1.6594 1.2344 1.9083 0.8447 1.0957 0.9404 4.6561 3.2778 22.6231 2.6340 4.4457 4.9076 1.3958 8.0080 0.9375 2.7930 2.9261 64.6092 8.0822 68.8136 2.8418 50.9999 6.9127 15.8128 5.0324 49.8736 27.5854 43.8337 39.5215 38.4257 14.2541 23.4231 16.2528 254.1962 0.0645 7.5398 1.3001 17.4578 4.5864 18.9152 56.5695 1.6552 10.6976 34.7234 35.6368 123.9312 56.7072 9.9524 259.0473 25.1582 16.5377 15.7908 8.1413 54.0521 17.2260 117.0194 43.3472 88.8228 66.8149 12.6249 126.6616 110.0589 2.4765 114.6335 30.1728 5.9193 11.7692 136.6238 1.8450 44.3883 35.7093 27.4540 67.2393 10.0027 67.5283 11.4088 3.2835 132.9683 85.6108 93.8225 1.7096 1.2679 55.6667 7.5237 8.6356 3.0357 13.4273 132.0174 4.3191 23.3816 39.7241 2.3320 11.2835 8.5233 1.4034 98.5752 6.8458 1.1606 22.4118 24.0078 123.7839 230.3415 11.1259 18.1739 13.0232 52.1888 30.6378 7.0946 94.3331 46.4418 645.0183 245.1047 56.2912 13.4125 4.5619 26.7441 11.1038 9.5588 20.1563 13.4492 1.1415 18.9718 10.1666 5.2070 19.3133 5.6841 0.0237 213.4215 126.5859 75.5898 26.7940 48.8622
temp: 298.150 k
press: 1.00000 atm
elementType: 17 17 15 8 8 8 8 7 7 7 7 7 7 7 6 6 6 6 6 6 6 6 6 6 6 6 6 6 1 1 1 1 1 1 1 1 1 1 1 1 1 1 1 1 1 1 1 1
symmnumber: 1
zpe: 940080.2 jmol-1
zpe.correction: 0.358058 hartree
zpe.thermalcorrener: 0.387284 hartree
zpe.thermalcorrenthalpy: 0.388228 hartree
zpe.thermalcorrgfe: 0.292687 hartree
zpe.sumelectzpe: -2488.857462 hartree
zpe.sumelectthermal: -2488.828235 hartree
zpe.sumelectthermalent: -2488.827291 hartree
zpe.sumelectthermalfe: -2488.922832 hartree
dipole: 2.2790 2.7369 2.9390
dipole: 4.6176
quadrupole: -212.9494 -191.5776 -171.6919
quadrupole: -1.5669 23.2561 6.2353
quadrupole: -20.8764 0.4954 20.3811 -1.5669 23.2561 6.2353
hfenergy: -2489.2155193 hartree
pointgroup: C01 [X(C14H20Cl2N7O4P1)]
dipole: -0.9588995 1.3332194 -0.7768087 debye
polarizability: 361.1566198|-11.3812711|199.3984368|16.27505|13.2425012|229.5662182 unknown
InChI: InChI=1S/C14H20Cl2N7O4P/c15-1-3-22(4-2-16)28(25,26)21-9-5-11(27-10(9)6-24)23-8-20-12-13(17)18-7-19-14(12)23/h5,7-8,10-11,21,24-25H,1-4,6,17H2
charge 0 multiplicity 1
48 atoms
Cl -3.800516 2.769021 2.814153
Cl -7.564045 -2.780044 0.790442
P  -3.034251 -1.039587 -0.899339
O  1.468964 1.432416 -1.589344
O  -4.015839 -1.335769 -2.304704
O  -1.855117 3.156572 -1.195033
O  -2.193516 -2.326414 -0.46561
N  2.564916 -0.081085 -0.045115
N  -2.026595 0.338659 -1.208432
N  -4.267942 -0.336025 0.10705
N  3.290119 0.090982 2.127698
N  4.714513 -0.696702 -1.139251
N  6.560921 -0.851009 0.481285
N  6.279754 -0.451516 2.794242
C  0.023274 1.659965 -1.746927
C  1.699888 -0.00725 -1.22531
C  -0.627029 0.357629 -1.289328
C  0.317375 -0.583606 -1.013422
C  -0.415907 2.891738 -0.923966
C  3.939746 -0.365652 -0.068261
C  -3.852081 0.408245 1.325688
C  -5.653787 -0.869153 0.071738
C  2.238439 0.187732 1.296781
C  4.364389 -0.257878 1.281983
C  -4.192723 1.900624 1.180068
C  -5.758148 -2.227221 0.789825
C  5.742887 -0.518474 1.536741
C  6.012397 -0.921389 -0.770959
H  -0.193032 1.848211 -2.821239
H  2.283843 -0.466755 -2.045369
H  0.137053 -1.605715 -0.681795
H  -2.4745 1.257514 -1.347681
H  -0.339565 2.6942 0.157023
H  0.209439 3.766667 -1.17726
H  -2.767636 0.291139 1.498517
H  -4.364253 -0.0066 2.214197
H  -5.979635 -0.969616 -0.975134
H  -6.314617 -0.133222 0.563465
H  1.224489 0.434936 1.600721
H  -5.265179 2.069174 1.001841
H  -3.580186 2.407434 0.420273
H  -5.458476 -2.177425 1.847325
H  -5.197371 -3.018165 0.269938
H  -3.703962 -2.126554 -2.814696
H  -1.947735 3.809971 -1.930472
H  6.702334 -1.19182 -1.575744
H  7.269997 -0.650796 2.91901
H  5.6882 -0.209385 3.586088
