program: Gaussian 09
title: 000191939
version: EM64L-G09RevD.01
frameworkgroup: C1[X(C6H12N2O4S)]
method: RPBEPBE
basis: SDD
operation: Freq
keyword: #p
keyword: freq=noraman
keyword: PBEPBE/SDD
title: #p freq=noraman PBEPBE/SDD
converged: YES YES NO NO
title: Mulliken charges:
elementType: S O O O O N N C C C C C C H H H H H H H H H H H H
charge: 1.011103 -0.625767 -0.502294 -0.500426 -0.154147 -0.055676 0.075263 -0.059516 -0.422944 -0.422508 -0.394285 -0.393298 -0.395074 0.308667 0.212477 0.231882 0.236936 0.210227 0.216827 0.208520 0.209421 0.216769 0.213381 0.198606 0.375853
chargesum: 0.00000
title: Mulliken charges with hydrogens summed into heavy atoms:
elementType: S O O O O N N C C C C C C
charge: 1.011103 -0.249913 -0.502294 -0.500426 -0.154147 -0.055676 0.075263 0.249151 0.021415 0.024656 0.031062 0.032893 0.016913
polarizability: 1.83857716e+02 -1.24276431e+01 1.39108293e+02 3.67784509e-01 -2.44527115e+00 1.02470020e+02
1716.lowfreq: -22.0685 -0.0025 -0.0014 -0.0008 2.6844 7.3160 15.7487 26.4185 39.9403
frequency: 8.0659 23.8536 39.9341 65.9164 76.5214 91.3605 110.8969 137.3696 149.1416 217.8911 230.6713 275.2255 281.5753 327.4139 345.1093 362.2653 396.1847 406.1458 451.6478 473.0640 493.2455 499.2761 687.2873 772.9510 786.4536 828.9582 840.6826 862.6700 892.7071 894.0991 922.1179 927.5401 991.4675 1014.5390 1043.6104 1057.3327 1072.1897 1109.3074 1144.4655 1190.7088 1194.0688 1245.7223 1252.3946 1256.9980 1310.6236 1315.5388 1320.3760 1335.1051 1343.4474 1344.0616 1357.8434 1461.1929 1462.5002 1463.5245 1470.4390 1477.9457 1578.8879 2976.9125 2980.5676 2981.1676 2984.6883 2986.2725 3040.4373 3042.0530 3044.9736 3051.7666 3058.6570 3069.6348 3488.9020
redmass: 6.4610 4.1617 8.2916 6.8077 5.8489 3.1511 6.8120 1.6146 4.9769 1.7868 3.5440 7.1051 8.4929 2.2004 6.3805 4.4646 5.0475 4.8917 5.3094 4.9408 1.6954 8.5298 5.1433 2.7373 1.4296 8.0926 2.7460 2.1091 2.2303 1.8782 1.6918 18.6485 2.4494 1.1724 1.9308 1.4044 1.2519 2.3935 2.3845 1.5217 4.8132 1.3181 1.3157 1.2700 1.3164 1.2518 1.2678 1.3510 1.4564 1.4449 1.4223 1.0849 1.0865 1.0868 1.0809 1.0929 12.6751 1.0649 1.0633 1.0624 1.0607 1.0624 1.0948 1.0981 1.0886 1.1018 1.1021 1.0995 1.0664
irintensity: 1.3544 0.0304 1.8304 12.5861 0.7329 10.7890 15.2774 58.6351 0.6257 0.0054 7.6701 45.5537 6.7133 0.2464 0.1640 27.1438 17.6236 2.3885 1.0881 41.5689 8.4333 126.3173 195.2017 44.5174 0.8347 68.1063 9.5248 49.2575 41.6250 26.0096 0.5007 94.5722 16.5556 39.4495 0.1150 0.8083 0.3564 0.1023 12.8570 0.1871 118.0470 6.9120 18.2796 2.0357 0.3532 5.5572 11.8310 0.5729 4.7348 6.2413 35.7002 1.0322 14.1751 12.2337 27.3098 2.8466 242.7063 31.9258 30.0666 24.4213 4.5850 18.8441 44.0916 41.7595 5.4514 44.9919 12.1159 23.8647 39.3351
temp: 298.150 k
press: 1.00000 atm
elementType: 16 8 8 8 8 7 7 6 6 6 6 6 6 1 1 1 1 1 1 1 1 1 1 1 1
symmnumber: 1
zpe: 492852.9 jmol-1
zpe.correction: 0.187718 hartree
zpe.thermalcorrener: 0.203282 hartree
zpe.thermalcorrenthalpy: 0.204226 hartree
zpe.thermalcorrgfe: 0.141175 hartree
zpe.sumelectzpe: -1043.016880 hartree
zpe.sumelectthermal: -1043.001316 hartree
zpe.sumelectthermalent: -1043.000371 hartree
zpe.sumelectthermalfe: -1043.063422 hartree
dipole: -7.2331 -1.4035 0.2388
dipole: 7.3719
quadrupole: -94.7183 -82.8749 -88.5252
quadrupole: -4.3780 0.3586 -0.3728
quadrupole: -6.0122 5.8312 0.1810 -4.3780 0.3586 -0.3728
hfenergy: -1043.2045974 hartree
pointgroup: C01 [X(C6H12N2O4S1)]
dipole: 2.8751582 0.3664681 0.1049536 debye
dipolederiv: 1.2443286 0.1960027 0.0832988 -0.242354 1.402415 0.1079 -0.1135292 0.0868277 1.2450717 -0.3924315 -0.2742148 -0.1350284 -0.1054489 -0.9472811 -0.173118 -0.0606176 -0.1702484 -0.6285431 -0.6603985 0.0677162 0.1484493 0.081207 -0.4800086 -0.0117795 0.2515098 0.0299351 -0.6112607 -0.6702012 0.1542148 -0.0373594 0.2375845 -0.528346 0.0695966 -0.1043714 0.0411852 -0.5394601 0.0575208 -1.243319 -0.5715107 -0.3474359 -0.3730872 -0.0920811 -0.1762711 -0.0800674 -0.1632424 0.8107044 -0.6850764 -0.3396023 -1.1743069 0.1374041 0.1991054 -0.5797221 0.1704449 -0.108437 -0.8717731 1.7792598 0.8457032 1.1353283 0.2326036 0.0182321 0.578102 0.0105835 0.0992892 0.3496735 -0.0113094 -0.0201216 0.3901614 0.0631955 -0.0697203 0.1447372 -0.0411271 0.1516703 -0.064295 -0.0350068 0.021351 -0.2093174 0.0768333 0.0124393 0.1864328 0.0337217 0.0771125 -0.1121789 -0.0132736 -0.0393877 0.0280705 0.0956505 0.0326134 -0.2394291 -0.0027659 0.0723236 0.059019 -0.0274013 -0.013801 0.1921409 0.1146228 0.0747535 -0.0768317 0.025456 0.0651215 0.0931694 -0.0162938 -0.0195394 0.0366712 0.1215593 0.0144658 0.18516 0.0782297 0.0481569 0.0522757 0.0004206 0.0002346 -0.0680933 0.1125611 0.0462137 -0.0408245 0.0426591 0.0660295 0.110539 0.0334191 0.016002 0.0099088 0.0360086 -0.0216519 0.0141649 -0.0212981 0.0556311 0.0065365 0.0031514 -0.0327197 0.0101863 -0.0554216 -0.0551958 -0.0618649 -0.1194948 0.0091259 0.023109 -0.0405387 0.0967984 -0.0208329 0.051531 0.0438723 0.0795702 0.0633381 -0.0802502 -0.0011665 0.0688446 -0.090794 0.0669211 0.0168246 0.0765617 -0.0688122 0.0520848 -0.0060713 0.0226353 -0.0237213 0.0319981 -0.0451942 -0.0924431 -0.1031902 0.0424145 -0.0320082 0.0273452 -0.0936909 0.0659431 -0.0926315 0.0430239 -0.0076541 0.1076542 -0.0768834 0.0867907 -0.0243704 0.0494014 0.031953 0.0660616 -0.0272328 -0.0871837 -0.1292341 0.0438389 -0.0742675 0.0032594 0.0361235 0.0673803 -0.0041156 0.0260318 -0.1003699 -0.0659175 -0.0371801 -0.1257612 0.0289808 -0.0630762 -0.0441279 0.0905427 -0.0482603 0.0591999 0.0556707 0.0716976 0.0759868 -0.1225264 -0.1816686 -0.0871206 -0.0311333 -0.1255033 0.0281409 -0.0000667 -0.0512445 -0.0034838 0.0488557 0.0862827 0.0212988 0.0074342 0.0950923 -0.1159204 -0.0842785 0.0480015 -0.0782977 -0.0306873 0.1095616 0.0117992 0.0198704 0.0616521 0.2391655 -0.052845 0.0419526 -0.048423 0.316876 unknown
polarizability: 182.0512522|-12.828692|134.4166514|-8.3670495|14.5308474|108.968125 unknown
InChI: InChI=1S/C6H11N2O.HO3S/c9-8-7-6-4-2-1-3-5-6;1-4(2)3/h6H,1-5H2;1H
charge 0 multiplicity 1
25 atoms
S  -2.635074 0.508732 0.432353
O  -1.476683 1.896247 1.021168
O  -3.447323 0.00304 1.744475
O  -3.49559 1.119681 -0.801384
O  -1.858804 -2.390327 -0.93159
N  -0.618358 -0.629006 -0.122752
N  -0.798309 -1.762577 -0.659724
C  0.7275 -0.018926 0.111823
C  1.610071 -0.937079 0.994289
C  1.409694 0.332908 -1.234603
C  2.974346 -0.251075 1.249866
C  2.776206 1.00827 -0.963311
C  3.681121 0.122392 -0.074967
H  0.485642 0.910348 0.657003
H  1.761782 -1.900564 0.468035
H  1.096059 -1.151243 1.949158
H  0.75549 1.000201 -1.824468
H  1.555785 -0.599719 -1.815949
H  3.611574 -0.92683 1.850882
H  2.818115 0.663308 1.857354
H  2.610594 1.985581 -0.466691
H  3.272234 1.222003 -1.928665
H  4.631501 0.646488 0.138864
H  3.942054 -0.804561 -0.625277
H  -2.052025 2.623811 1.395113
