program: Gaussian 09
title: 000017879
version: EM64L-G09RevD.01
frameworkgroup: C1[X(C19H20N3)]
method: RPBEPBE
basis: SDD
operation: Freq
keyword: #p
keyword: freq=noraman
keyword: PBEPBE/SDD
title: #p freq=noraman PBEPBE/SDD
converged: YES YES NO NO
title: Mulliken charges:
elementType: N N N C C C C C C C C C C C C C C C C C C C H H H H H H H H H H H H H H H H H H H H
charge: -0.071855 -0.463713 -0.024692 -0.389680 -0.394201 -0.428526 -0.401554 -0.475787 -0.013972 0.034623 0.321126 0.256164 0.301588 0.070582 -0.404794 -0.367390 -0.377102 -0.353957 -0.218057 -0.252384 -0.244415 -0.220252 0.214079 0.250921 0.251731 0.214661 0.275473 0.264699 0.227788 0.260461 0.268657 0.247867 0.297486 0.325622 0.231242 0.258182 0.257180 0.260394 0.251955 0.252782 0.251953 0.255115
chargesum: 1.00000
title: Mulliken charges with hydrogens summed into heavy atoms:
elementType: N N N C C C C C C C C C C C C C C C C C C C
charge: -0.071855 -0.138090 -0.024692 0.075320 0.072191 0.111646 0.086694 0.040736 0.283513 0.034623 0.321126 0.256164 0.301588 0.070582 -0.173552 -0.109208 -0.119922 -0.093563 0.033898 0.000398 0.007538 0.034863
polarizability: 3.65467008e+02 -1.22163752e+01 2.87094501e+02 -9.55010565e-01 -1.18004505e+00 1.15073080e+02
1716.lowfreq: -7.5747 -4.8725 -0.3493 0.0004 0.0006 0.0008 26.5578 39.3881 52.5415
frequency: 26.4171 39.2560 52.5374 80.8398 102.0550 129.4754 144.4826 187.4526 209.9472 216.8694 261.4755 272.8011 306.6699 317.4827 327.7138 335.6204 360.5811 371.5256 425.7423 435.0574 472.4889 488.6879 497.3031 515.8713 530.4757 557.8015 564.4369 573.8835 599.9742 613.0920 653.3037 662.8088 690.3719 719.6453 748.1197 759.9217 769.3602 779.9511 807.8245 813.8255 832.2113 841.1318 860.0480 865.2994 875.1675 890.4993 904.2285 952.7099 955.7782 968.2705 972.0635 990.0229 992.3397 994.1386 999.6989 1036.3856 1054.1285 1056.1242 1071.0287 1085.9480 1100.8766 1121.0488 1130.7637 1142.2133 1166.8644 1180.5519 1183.5984 1210.8558 1217.6522 1234.8135 1246.4842 1267.5804 1269.2436 1276.2516 1283.2762 1287.9923 1308.3871 1344.4001 1347.6799 1360.0320 1361.7664 1367.4363 1369.7015 1383.1702 1418.4579 1429.4190 1451.9118 1455.4841 1465.7175 1467.6213 1469.0468 1470.5854 1476.7957 1504.6100 1561.6838 1569.4930 1588.0175 1599.2949 1612.1678 1674.9817 2966.2479 2981.7903 2986.4894 3003.2142 3012.1938 3051.5519 3057.1246 3069.9502 3085.6802 3103.4808 3119.7706 3144.5055 3146.4799 3150.5264 3156.2943 3162.5373 3167.1030 3180.2810 3181.8096 3520.4394
redmass: 3.5832 4.0599 4.1159 4.1267 4.4727 3.6134 3.9360 2.9840 2.6622 3.8893 4.0135 4.2903 4.3029 2.0943 4.4119 3.3096 3.4611 4.0888 4.0902 3.4445 1.7299 2.1561 2.9055 1.9224 3.3301 3.5724 4.1324 4.2666 6.2087 6.6244 5.8216 2.5872 4.8555 3.2759 3.0510 3.2841 1.4210 1.3466 3.6690 1.7770 3.3874 2.8265 1.8708 1.7405 2.2939 1.4633 2.3200 1.4429 1.8016 1.4093 2.2370 2.5468 3.9975 1.3633 1.3561 2.6232 2.2494 2.0971 2.2310 2.7764 2.0274 2.2920 1.5635 2.3266 1.3330 1.0764 1.0875 2.9147 1.2042 1.3258 2.0104 1.1977 2.2186 1.6001 1.2775 1.8203 1.1943 1.3484 1.2493 2.2860 2.4553 1.4713 6.0404 1.4564 1.7933 2.3710 1.1062 1.1064 1.1357 2.3466 1.7680 1.1481 1.1535 2.5196 5.5243 5.6291 5.9171 5.8724 6.2760 9.4607 1.0667 1.0676 1.0628 1.0622 1.0661 1.0964 1.0991 1.1034 1.0932 1.0983 1.0900 1.0916 1.0867 1.0874 1.0896 1.0933 1.0945 1.1008 1.1012 1.0765
irintensity: 0.0484 0.3119 0.0409 0.9028 2.1702 3.7720 0.9099 1.1881 1.9039 3.7194 1.8063 2.1629 4.2260 3.1194 0.6695 0.9182 1.8803 11.3855 9.8946 1.7559 47.6554 4.3534 19.0946 30.7089 13.6252 11.9689 6.3468 1.0167 3.0658 2.4477 18.8125 15.9485 4.8021 18.0921 30.5381 0.1725 77.6325 72.1168 1.6194 3.5742 7.9944 11.1308 11.1810 9.5790 1.5669 1.1329 16.6230 8.2796 32.0795 1.0131 8.6218 8.0588 0.9683 0.2205 0.0105 3.1459 1.6872 3.9770 13.8626 7.1753 7.4612 10.0979 14.3506 10.0354 5.7562 0.8515 0.3484 12.6798 4.7493 0.1586 7.4358 5.6197 20.7249 10.7297 8.7928 11.6245 19.6934 2.1905 0.7725 1.1977 7.7475 1.8114 15.9942 20.8850 35.6183 12.8627 5.7585 0.6854 15.0581 61.3179 77.2645 12.1720 34.6879 4.8865 57.9384 59.0074 6.9769 14.8529 10.9385 159.0922 3.4984 6.9127 31.1318 20.8217 4.3017 20.1938 21.2336 25.0989 12.2919 3.1214 10.1443 13.5323 2.1013 1.0520 2.7543 5.8001 8.0957 11.3205 13.7016 30.5575
temp: 298.150 k
press: 1.00000 atm
elementType: 7 7 7 6 6 6 6 6 6 6 6 6 6 6 6 6 6 6 6 6 6 6 1 1 1 1 1 1 1 1 1 1 1 1 1 1 1 1 1 1 1 1
symmnumber: 1
zpe: 916613.3 jmol-1
zpe.correction: 0.349120 hartree
zpe.thermalcorrener: 0.367048 hartree
zpe.thermalcorrenthalpy: 0.367993 hartree
zpe.thermalcorrgfe: 0.302947 hartree
zpe.sumelectzpe: -898.480489 hartree
zpe.sumelectthermal: -898.462560 hartree
zpe.sumelectthermalent: -898.461616 hartree
zpe.sumelectthermalfe: -898.526661 hartree
dipole: -7.6301 0.2627 -0.4594
dipole: 7.6485
quadrupole: -51.7009 -93.4349 -128.7895
quadrupole: 1.9897 -1.0329 0.6802
quadrupole: 39.6076 -2.1265 -37.4811 1.9897 -1.0329 0.6802
hfenergy: -898.8296084 hartree
pointgroup: C01 [X(C19H20N3)]
dipole: -2.998993 -0.1238348 0.2136207 debye
polarizability: 365.2323017|12.8659661|287.0489026|-1.8508848|-7.0093233|115.3533848 unknown
InChI: InChI=1S/C19H20N3/c1-2-8-14-22(13-7-1)19-20-17-11-5-3-9-15(17)16-10-4-6-12-18(16)21-19/h3-6,9-13,20H,1-2,7-8,14H2
charge 1 multiplicity 1
42 atoms
N  -2.20416 0.261088 -0.248902
N  -0.277783 -0.867608 0.65788
N  -0.096751 1.273709 -0.504086
C  -3.943586 -1.511089 0.371159
C  -5.293712 -0.758489 0.303789
C  -2.889566 -1.022125 -0.647137
C  -5.221676 0.753072 0.615638
C  -4.322306 1.575397 -0.371924
C  -2.856609 1.406704 -0.139535
C  -0.727666 0.245921 -0.034608
C  0.956006 -1.555578 0.349328
C  2.147682 -0.849892 0.019572
C  2.300366 0.641982 0.070659
C  1.266823 1.583236 -0.266027
C  0.920368 -2.967488 0.386386
C  3.271489 -1.641308 -0.351391
C  3.57566 1.178262 0.39104
C  1.56245 2.969355 -0.372603
C  2.070624 -3.722634 0.074077
C  3.246675 -3.050984 -0.321299
C  3.84823 2.563085 0.343024
C  2.841244 3.467367 -0.062014
H  -3.527994 -1.465584 1.398023
H  -4.12584 -2.580271 0.155108
H  -5.997371 -1.230663 1.01352
H  -5.73136 -0.899927 -0.705224
H  -2.0943 -1.768712 -0.794458
H  -3.362502 -0.841035 -1.63136
H  -4.87888 0.921597 1.654373
H  -6.237809 1.180986 0.547408
H  -4.559959 2.647528 -0.283527
H  -4.576576 1.268429 -1.409562
H  -2.228414 2.263966 0.132531
H  -0.923233 -1.353995 1.284647
H  -0.009683 -3.480079 0.662694
H  4.185317 -1.137893 -0.681317
H  4.372703 0.49809 0.706882
H  0.75645 3.637318 -0.690646
H  2.038924 -4.815421 0.121311
H  4.138965 -3.617492 -0.603833
H  4.845054 2.928239 0.609311
H  3.048109 4.539434 -0.13191
