program: Gaussian 09
title: 000191914
version: EM64L-G09RevD.01
frameworkgroup: C1[X(C16H18N2O3S)]
method: RPBEPBE
basis: SDD
operation: Freq
keyword: #p
keyword: freq=noraman
keyword: PBEPBE/SDD
title: #p freq=noraman PBEPBE/SDD
converged: YES YES NO NO
title: Mulliken charges:
elementType: S O O O N N C C C C C C C C C C C C C C C C H H H H H H H H H H H H H H H H H H
charge: 0.974399 -0.488897 -0.525924 -0.232229 -0.438127 -0.199870 -0.325618 -0.425160 -0.505129 0.258622 -0.219951 0.416859 0.178011 -0.265213 0.303346 -0.367842 -0.369478 -0.265091 -0.368381 -0.271837 -0.650883 -0.658446 0.260905 0.244130 0.237352 0.233369 0.257733 0.248611 0.290608 0.293887 0.276733 0.240272 0.242101 0.229649 0.248524 0.204681 0.228424 0.219300 0.263354 0.227204
chargesum: 0.00000
title: Mulliken charges with hydrogens summed into heavy atoms:
elementType: S O O O N N C C C C C C C C C C C C C C C C
charge: 0.974399 -0.488897 -0.525924 -0.232229 -0.438127 -0.199870 0.179417 0.045562 0.001215 0.258622 -0.219951 0.416859 0.178011 0.025395 0.303346 -0.073955 -0.092745 -0.024819 -0.126280 -0.042188 0.030746 0.051412
polarizability: 3.20498377e+02 -1.66182799e+01 2.23277442e+02 -7.90145259e+00 -2.31682280e+01 1.60706142e+02
1716.lowfreq: -3.4944 -3.0956 -0.0012 -0.0005 0.0005 8.2542 27.3020 29.8156 42.0795
frequency: 27.1305 29.4229 42.0679 67.4775 80.0844 100.8014 121.5273 137.6734 143.6143 159.7273 170.6029 182.4494 191.7275 211.1832 218.5852 225.8788 241.7830 260.1350 278.5443 296.7524 314.8841 337.7781 365.9265 399.3283 444.7994 466.5211 486.1392 490.2507 502.8073 520.1820 527.2779 533.7424 576.2579 584.1064 612.8900 662.7824 667.4767 714.8618 738.7181 778.8823 798.3993 803.9094 820.3152 823.9142 828.3885 880.6621 891.0648 895.8312 923.1068 923.5892 936.6959 947.6171 978.6434 992.4269 1016.7787 1029.7073 1052.3174 1064.4379 1072.4439 1081.9663 1089.7400 1099.2708 1130.4363 1154.6318 1156.4608 1176.6262 1179.6592 1193.8915 1201.8483 1211.7872 1216.0732 1223.5839 1261.5177 1280.6642 1318.5949 1332.7495 1338.9940 1360.8593 1379.9514 1402.6795 1427.0876 1429.3086 1440.5253 1447.0361 1459.8229 1465.6771 1473.2512 1475.4591 1482.0567 1497.4743 1499.9956 1506.2574 1575.3281 1587.0946 1617.4057 1640.2650 2898.8731 2918.1284 2999.9666 3010.4688 3020.5737 3026.1726 3029.2872 3087.5068 3094.0535 3094.6334 3105.8278 3115.5427 3139.4156 3145.3862 3159.0785 3162.5229 3174.4728 3206.4590
redmass: 5.0042 4.7850 4.5965 4.6466 2.6398 4.4030 3.0327 5.2101 3.0315 3.0974 4.0795 2.5269 3.2933 2.8742 3.5862 8.2944 4.1586 1.3229 3.0215 5.3299 4.5090 3.3146 3.2117 10.4448 9.5504 3.3191 4.4897 5.1443 6.0218 5.4826 2.7480 5.1609 5.3029 3.3352 3.6517 4.3242 4.5384 6.9304 1.6414 5.2322 1.5359 3.1400 2.5884 4.1434 2.8828 2.7006 1.6573 1.5972 4.1111 2.4267 1.4724 7.1454 1.3601 1.3353 2.2304 3.4545 1.4813 2.2303 2.1649 2.9724 1.3573 1.8415 1.4263 1.6338 1.2416 1.4297 1.7008 1.7696 1.9772 1.6396 1.7688 1.8673 1.8558 1.2997 1.3517 2.0985 1.5803 3.0080 5.6069 2.4186 1.5344 1.8076 1.4896 1.0830 1.5684 1.0675 1.0909 1.0784 1.0618 1.0816 1.5112 2.1394 6.7235 5.2071 6.9394 12.0176 1.0531 1.0504 1.0663 1.0646 1.0866 1.0621 1.0787 1.0996 1.1003 1.0984 1.1041 1.0962 1.0877 1.0865 1.0916 1.0944 1.0985 1.0950
irintensity: 0.3322 1.8344 4.9505 1.2631 4.9948 0.8517 2.2253 7.0135 0.8979 2.5863 6.2128 0.1073 0.9306 2.7632 4.1090 0.4855 6.4976 0.3434 2.4635 3.2410 1.2535 3.2084 2.7811 48.8284 181.9625 2.0796 15.5558 1.2650 39.4715 20.8670 6.1724 1.6603 15.4017 1.9486 11.7758 1.9015 5.6641 5.6570 1.7056 1.0396 62.2575 98.7617 3.7671 2.4288 48.3624 32.2794 15.3049 1.8749 29.3558 18.7017 11.7314 53.5496 2.0827 1.3451 47.6003 61.0106 15.7306 20.3267 14.9954 53.4233 3.1401 2.4725 40.3606 8.7502 7.3117 15.1529 54.2241 6.1563 12.4937 25.3768 14.3403 68.8155 17.1515 6.3334 5.0056 25.7298 19.5775 81.4364 48.7957 11.2245 12.4036 6.0953 35.6355 7.4277 35.3786 30.6268 8.9867 21.7944 14.1878 10.3051 10.2736 27.9776 90.9113 28.2669 5.9541 237.0700 114.5835 166.8984 38.6604 12.7546 41.5733 34.4068 38.1094 15.9903 22.0196 5.5042 30.3531 18.8243 13.8193 3.7226 2.6489 19.9141 15.6670 6.8913
temp: 298.150 k
press: 1.00000 atm
elementType: 16 8 8 8 7 7 6 6 6 6 6 6 6 6 6 6 6 6 6 6 6 6 1 1 1 1 1 1 1 1 1 1 1 1 1 1 1 1 1 1
symmnumber: 1
zpe: 818230.3 jmol-1
zpe.correction: 0.311647 hartree
zpe.thermalcorrener: 0.332922 hartree
zpe.thermalcorrenthalpy: 0.333866 hartree
zpe.thermalcorrgfe: 0.261033 hartree
zpe.sumelectzpe: -1351.955127 hartree
zpe.sumelectthermal: -1351.933853 hartree
zpe.sumelectthermalent: -1351.932909 hartree
zpe.sumelectthermalfe: -1352.005742 hartree
dipole: 2.6559 0.6181 -4.6847
dipole: 5.4205
quadrupole: -95.2373 -137.3534 -144.3888
quadrupole: 3.8807 12.1438 -7.4880
quadrupole: 30.4225 -11.6935 -18.7290 3.8807 12.1438 -7.4880
hfenergy: -1352.2667746 hartree
pointgroup: C01 [X(C16H18N2O3S1)]
dipole: -1.1018567 -0.7537534 -1.6630454 debye
polarizability: 317.5002283|-20.3537133|233.7122037|13.8603185|-2.9259185|153.2695293 unknown
InChI: InChI=1S/C16H18N2O3S/c1-17(2)14-8-3-7-13-12(14)6-4-9-15(13)22(20,21)18-11-5-10-16(18)19/h3-4,6-9H,5,10-11H2,1-2H3
charge 0 multiplicity 1
40 atoms
S  1.915337 -0.52309 1.210258
O  1.959179 0.815981 2.11817
O  2.477575 -1.921416 1.828841
O  2.052495 1.613606 -1.230591
N  3.04147 -0.321855 -0.282381
N  -4.4836 0.167581 -0.688734
C  4.308391 -1.094684 -0.337003
C  4.810874 -0.743199 -1.768378
C  4.242197 0.674499 -2.039921
C  2.971968 0.759895 -1.171779
C  0.186693 -0.873598 0.478753
C  -0.797263 0.152314 0.287074
C  -2.099807 -0.319099 -0.176588
C  0.000086 -2.225178 0.205428
C  -3.186613 0.636205 -0.332404
C  -0.579021 1.553677 0.483048
C  -2.266916 -1.695634 -0.527994
C  -1.248199 -2.634141 -0.344722
C  -2.910464 2.005798 -0.170153
C  -1.615719 2.449751 0.22093
C  -5.397742 1.107587 -1.357053
C  -5.188026 -0.745245 0.243287
H  4.118077 -2.168367 -0.187153
H  5.011918 -0.75284 0.445898
H  4.389282 -1.462398 -2.491938
H  5.910355 -0.789985 -1.832546
H  3.994572 0.870134 -3.095254
H  4.9316 1.471481 -1.701222
H  0.794796 -2.947207 0.41775
H  0.396359 1.914647 0.809121
H  -3.21299 -1.999792 -0.985047
H  -1.396449 -3.681586 -0.624278
H  -3.705988 2.744376 -0.30714
H  -1.439211 3.523355 0.347193
H  -4.864488 1.65617 -2.151031
H  -5.858576 1.847884 -0.661343
H  -6.218498 0.5337 -1.82411
H  -5.811255 -0.174805 0.968849
H  -4.469035 -1.34555 0.819812
H  -5.852063 -1.430871 -0.316146
