program: Gaussian 09
title: 000191911
version: EM64L-G09RevD.01
frameworkgroup: C1[X(C7H12N4O)]
method: RPBEPBE
basis: SDD
operation: Freq
keyword: #p
keyword: freq=noraman
keyword: PBEPBE/SDD
title: #p freq=noraman PBEPBE/SDD
converged: YES YES NO NO
title: Mulliken charges:
elementType: O N N N N C C C C C C C H H H H H H H H H H H H
charge: -0.317239 -0.350046 -0.413974 -0.082409 -0.518040 -0.525051 -0.346303 0.411378 -0.467015 0.233418 -0.519471 -0.244474 0.261733 0.224962 0.215003 0.239707 0.309129 0.343297 0.257646 0.218934 0.251925 0.255208 0.289112 0.272570
chargesum: 0.00000
title: Mulliken charges with hydrogens summed into heavy atoms:
elementType: O N N N N C C C C C C C
charge: -0.317239 -0.040917 -0.070678 -0.082409 0.043642 -0.038356 0.108407 0.411378 -0.209369 0.233418 -0.048612 0.010733
polarizability: 1.08336382e+02 -3.43214328e+00 1.08964689e+02 9.93460287e+00 -3.79450313e+00 8.15499495e+01
1716.lowfreq: -13.3859 -6.6145 -0.0006 0.0002 0.0007 8.8601 32.2168 47.4103 72.0397
frequency: 32.1207 47.3622 72.0291 99.1239 122.3761 135.4897 167.2213 219.5407 276.0265 300.5029 335.7464 387.7951 498.7299 538.7968 584.7326 621.5156 652.5976 669.8897 692.5747 745.4064 773.7534 781.4094 813.8827 839.0731 871.7570 891.8384 895.3482 930.5237 988.7829 1032.8184 1062.9931 1093.7574 1112.7350 1127.5049 1154.1734 1194.7869 1231.9745 1243.8953 1245.8308 1260.7464 1319.9080 1327.4227 1343.7776 1349.3254 1369.3222 1375.6496 1431.1937 1440.9263 1456.9200 1461.2009 1509.0765 1562.1622 1607.8386 1661.4807 2977.4897 2980.4657 3013.6807 3038.4595 3052.0673 3083.2275 3219.6815 3238.1139 3445.5947 3499.5165 3536.7117 3563.6054
redmass: 5.5028 2.1842 5.3284 4.2671 4.4693 3.1921 2.6614 1.4375 3.6257 3.0075 2.2500 3.4960 3.4266 2.2087 1.4007 3.7875 3.6214 2.4479 2.0722 2.3569 1.3921 1.1556 1.4757 2.3876 3.2351 1.6307 5.1859 3.1391 3.3230 2.0461 3.5031 2.2558 1.8764 2.0971 1.7987 1.4215 2.2449 1.4240 1.7143 1.3288 1.2984 1.5790 1.2852 1.3853 1.6498 3.4722 2.8352 1.0918 1.1585 1.1528 1.6838 4.6172 5.4767 1.0816 1.0607 1.0631 1.0624 1.1016 1.1001 1.1002 1.0978 1.0993 1.0456 1.0838 1.0774 1.0958
irintensity: 3.5177 2.1689 6.6927 15.8109 0.0415 0.3478 2.5801 60.0190 7.7554 51.4256 12.5111 2.8356 2.9033 41.7608 60.8844 0.5463 19.2719 70.3352 57.5779 260.3247 77.6242 40.2763 55.0086 6.9745 1.9769 2.3975 14.9655 0.8377 14.6117 1.7148 2.4205 29.0578 8.9870 2.0399 6.2812 5.1027 12.4268 2.7066 37.8255 14.6288 6.7185 3.1730 18.1111 32.0890 28.8034 3.9031 14.5902 11.1111 14.6790 23.8445 109.6738 23.7306 120.7481 36.0368 27.5346 49.8052 39.0307 23.7258 12.3513 15.2616 7.4208 1.5962 1.3219 117.6781 19.2713 2.8920
temp: 298.150 k
press: 1.00000 atm
elementType: 8 7 7 7 7 6 6 6 6 6 6 6 1 1 1 1 1 1 1 1 1 1 1 1
symmnumber: 1
zpe: 518054.7 jmol-1
zpe.correction: 0.197317 hartree
zpe.thermalcorrener: 0.209563 hartree
zpe.thermalcorrenthalpy: 0.210507 hartree
zpe.thermalcorrgfe: 0.157435 hartree
zpe.sumelectzpe: -567.252935 hartree
zpe.sumelectthermal: -567.240689 hartree
zpe.sumelectthermalent: -567.239744 hartree
zpe.sumelectthermalfe: -567.292817 hartree
dipole: 3.2214 3.5429 -0.7440
dipole: 4.8459
quadrupole: -88.1629 -65.6355 -71.5401
quadrupole: -2.8123 -4.9577 -7.5288
quadrupole: -13.0501 9.4774 3.5727 -2.8123 -4.9577 -7.5288
hfenergy: -567.4502515 hartree
pointgroup: C01 [X(C7H12N4O1)]
dipole: 1.4517513 -1.1490217 0.4549619 debye
dipolederiv: -0.6587385 -0.070923 -0.111649 -0.1405915 -0.5164578 -0.0360893 -0.0488006 0.1604512 -0.9685452 -0.6755332 -0.2132799 0.131045 -0.1996406 -0.7605701 0.2479027 0.0778662 0.2422592 -0.4929617 -0.5957906 -0.0362015 0.1591011 -0.1021716 -0.1426528 0.0469327 0.2291487 0.0262337 -0.3338037 -0.4512603 0.0257396 0.0628372 0.0621883 -0.2895294 0.0007028 0.0950236 -0.0097496 -0.3080991 -0.5623701 -0.3256068 0.0468897 -0.4244793 -0.6210498 -0.0296205 0.0182898 -0.0698519 -0.359468 0.0879952 -0.0047155 -0.0098467 -0.064795 0.0946115 0.0162943 0.0015923 0.0231561 0.0884385 0.4131715 0.1584201 -0.0090439 0.117642 0.405261 0.0440776 0.0730302 0.0641307 0.1876633 0.1524352 0.0158248 -0.136412 0.1397312 0.0483222 -0.0909198 -0.2231744 -0.0500449 -0.002065 -0.0311602 0.0745337 -0.1400957 -0.0046833 0.0735396 -0.0588957 -0.1049709 -0.1163602 -0.1133076 0.4365065 0.3035777 0.0207449 0.4211926 0.7184382 -0.1986619 0.0035829 -0.3628852 1.1204441 0.4314041 0.1242877 -0.1035119 0.0537287 0.1723135 -0.0657564 -0.2133062 -0.1653058 0.217416 0.2847127 -0.061322 -0.2388677 -0.0630179 0.0571849 -0.0313633 -0.2479866 -0.0179876 0.0478686 0.0582018 0.066907 0.0687776 0.0658444 0.0654049 0.0599344 0.0481305 -0.0066166 -0.0425122 -0.030424 -0.1167085 -0.0224899 -0.0456927 -0.1017398 -0.017828 0.0022814 0.0130308 0.1077823 0.0271886 -0.0810889 0.0556521 -0.058191 0.0326202 0.0211367 0.0276845 0.0768043 -0.0974707 -0.1001852 0.1276569 0.0290447 0.050089 -0.1316471 -0.0245431 -0.0038043 -0.0963502 0.0654809 0.2334599 -0.0992758 -0.0325753 -0.105131 0.1913667 -0.0224389 -0.0400489 -0.0301696 0.1238547 0.4274163 -0.0392185 0.1307655 -0.0312676 0.2088939 -0.0285039 0.0579939 -0.0013362 0.2865361 0.1069933 -0.0526935 0.0666997 -0.0416558 -0.0033243 0.066824 0.0683982 0.0746827 0.1304103 0.02179 -0.017635 -0.0704264 -0.0052887 0.0210558 0.1181123 -0.0626203 0.0743915 -0.0954267 -0.0810701 0.0439668 0.0687848 0.0527551 -0.0176746 -0.0491206 0.0438331 -0.0150893 0.0718337 0.1222641 -0.0044292 0.049887 0.0004592 -0.0190953 0.0614562 0.0567522 0.0588276 0.146594 0.1697692 0.0813055 -0.0706616 0.1122435 0.3828833 -0.0307435 -0.0035604 0.0937013 0.0571719 0.2132239 0.1008785 0.0553509 0.2107319 0.1318452 0.0011112 0.1446653 0.034078 0.1621656 unknown
polarizability: 107.6121453|2.1617686|108.2751722|-9.2588422|-8.4426372|82.9637036 unknown
InChI: InChI=1S/C7H12N4O/c8-3-7(12)10-2-1-6-4-9-5-11-6/h4-5,10-11H,1-3,8H2
charge 0 multiplicity 1
24 atoms
O  1.539502 0.063958 -1.296175
N  1.202492 -0.832775 0.834217
N  -1.317334 0.713797 -0.792476
N  -3.225161 0.9605 0.394203
N  3.548253 1.853421 -0.247862
C  -0.747879 -1.75134 -0.570143
C  0.389973 -2.012369 0.461127
C  -1.61508 -0.558298 -0.27901
C  -2.800016 -0.379195 0.44676
C  1.730258 0.093591 -0.033413
C  2.543715 1.242963 0.626785
C  -2.304238 1.592092 -0.364238
H  -0.295535 -1.644649 -1.570397
H  -1.373632 -2.663043 -0.584982
H  -0.049701 -2.397106 1.398723
H  1.051898 -2.800453 0.048993
H  1.398223 -0.705773 1.829373
H  -0.484061 0.90982 -1.35594
H  -3.376348 -1.126086 0.989405
H  3.035099 0.887403 1.552649
H  1.817924 2.02216 0.934673
H  -2.320457 2.648057 -0.622942
H  3.138939 2.189668 -1.127514
H  4.341263 1.232257 -0.443915
