program: Gaussian 09
title: 000191893
version: EM64L-G09RevD.01
frameworkgroup: C1[X(C17H36O2)]
method: RPBEPBE
basis: SDD
operation: Freq
keyword: #pfreq=noraman
keyword: PBEPBE/SDD
title: #p freq=noraman PBEPBE/SDD
converged: YES YES NO NO
title: Mulliken charges:
elementType: O O C C C C C C C C C C C C C C C C C H H H H H H H H H H H H H H H H H H H H H H H H H H H H H H H H H H H H
charge: -0.439280 -0.433984 -0.385114 -0.387454 -0.387870 -0.385665 -0.384562 -0.383577 -0.390511 -0.392477 -0.373832 -0.375768 -0.402504 -0.021624 -0.414402 -0.108972 -0.716128 -0.716194 -0.354806 0.194183 0.192228 0.192703 0.194656 0.192615 0.195575 0.192012 0.193375 0.194539 0.191931 0.192420 0.192003 0.199492 0.192135 0.188176 0.202496 0.189446 0.193652 0.188812 0.187376 0.255672 0.180826 0.191545 0.181693 0.220390 0.214110 0.202897 0.209602 0.221925 0.205497 0.212342 0.211052 0.200804 0.220252 0.330270 0.336021
chargesum: 0.00000
title: Mulliken charges with hydrogens summed into heavy atoms:
elementType: O O C C C C C C C C C C C C C C C C C
charge: -0.109010 -0.097963 0.001296 -0.000095 0.000320 -0.000277 0.001907 0.000846 0.001116 -0.001805 0.009267 0.000420 0.033993 0.169921 -0.012319 0.105139 -0.081705 -0.087303 0.066250
polarizability: 2.54112564e+02 -4.15497858e+00 1.71148512e+02 -1.08667858e+00 3.94282297e+00 1.60003514e+02
1716.lowfreq: -4.9829 -0.0020 -0.0005 0.0011 3.8428 12.4102 16.1698 18.6526 23.7394
frequency: 15.8423 17.3524 23.0888 32.8405 42.8289 49.0867 59.4405 71.4236 84.2744 88.1089 102.3683 109.7739 117.9284 128.5612 135.0570 148.4589 153.3404 158.7508 166.1884 206.8460 213.9494 235.1704 249.4196 257.3395 295.4779 300.0834 317.8954 340.5352 370.4496 392.6462 403.9352 428.2366 439.8432 462.9089 486.8878 504.3759 526.6107 719.1536 720.9387 725.7241 734.9917 751.5517 780.2020 809.0252 822.5049 861.6690 879.0575 906.7128 912.5426 930.7721 938.1130 949.0003 955.7833 970.7703 980.5111 986.7342 997.7547 1013.1829 1021.5594 1025.2359 1042.9707 1049.8416 1055.5438 1072.9159 1078.7505 1081.0355 1081.9629 1088.3185 1098.0721 1126.1467 1138.7160 1158.9786 1176.6771 1178.4619 1191.5186 1200.4019 1212.2826 1224.3737 1234.7120 1246.0079 1255.3381 1266.2121 1273.6813 1278.3871 1283.1602 1285.0532 1290.1814 1293.4336 1295.1289 1298.8533 1299.1407 1306.4232 1314.8326 1327.3431 1331.3817 1339.5922 1348.6634 1352.9414 1354.8204 1355.0680 1357.5615 1358.1256 1366.8597 1374.8970 1375.9055 1391.6944 1454.9835 1457.2202 1458.4017 1458.9518 1461.4433 1462.2063 1464.1857 1468.7828 1469.6428 1471.9300 1472.4190 1476.3499 1481.2762 1482.5016 1486.0613 1489.5585 1489.7544 2943.8952 2944.0991 2947.7631 2947.9860 2948.8994 2949.9703 2950.6003 2952.3437 2953.5385 2957.5171 2961.5314 2963.8457 2964.7092 2967.1516 2968.7781 2976.7969 2981.0512 2983.6123 2987.6160 2992.0170 2996.5652 3003.9013 3005.3393 3015.8467 3018.8676 3027.5017 3036.8772 3043.1101 3055.8988 3057.3518 3063.2650 3063.3313 3065.8010 3073.3945 3545.0252 3564.3399
redmass: 4.4077 4.0509 3.1150 3.5226 1.8223 4.2317 3.2160 1.6894 2.4686 2.9582 2.3219 2.1696 3.5944 2.8272 1.7713 2.7618 1.9983 2.1771 2.9796 1.6284 1.6993 1.4081 2.0637 3.3751 1.3284 1.1965 2.2943 3.2482 2.9010 3.1408 2.3032 2.0794 3.4208 2.5137 3.4242 2.8478 3.3722 1.0580 1.0669 1.0828 1.1117 1.1612 1.2466 1.8656 1.5393 1.4418 2.1574 1.3276 1.1832 1.9892 2.2512 1.8569 1.8462 1.9555 4.3714 4.0181 1.6509 3.6428 1.5538 2.3797 1.1673 3.4016 2.8938 2.6032 2.1608 2.2262 2.1489 1.8959 1.6548 2.3830 2.3192 1.3794 1.7523 1.9801 1.6793 1.3551 1.4972 1.3671 1.3820 1.3387 1.3118 1.2999 1.2587 1.0177 1.2371 1.0318 1.2053 1.0998 1.1472 1.1219 1.1208 1.2564 1.3026 1.3861 1.4205 1.3936 1.4445 1.6765 1.5479 1.6412 1.6167 1.5956 1.2044 1.2226 1.2398 1.2152 1.0723 1.0786 1.0705 1.0786 1.0688 1.0688 1.0789 1.0546 1.0804 1.0805 1.0657 1.0976 1.0769 1.0784 1.0980 1.0841 1.0653 1.0615 1.0628 1.0586 1.0586 1.0591 1.0590 1.0597 1.0714 1.0661 1.0610 1.0605 1.0389 1.0565 1.0652 1.0364 1.0622 1.0958 1.0962 1.0969 1.0979 1.1008 1.0899 1.1006 1.1022 1.0950 1.1047 1.1045 1.1044 1.0993 1.0998 1.0993 1.1020 1.0992 1.0987 1.0659 1.0662
irintensity: 0.0132 0.0162 0.0248 0.0058 0.1070 0.0269 0.0748 0.8097 0.4896 0.8576 0.5646 0.9942 0.0737 0.7779 0.3583 0.0990 0.1049 0.1151 2.9820 1.7594 2.1647 0.0870 0.0766 2.3299 147.0581 58.9554 94.7654 0.9699 32.9776 1.1421 28.3842 18.4192 2.4006 4.5631 1.5571 0.3269 2.5402 19.6631 0.0390 6.4807 0.3596 3.9799 0.6881 3.4037 2.9350 0.6071 7.3663 5.0387 4.9188 12.1877 17.7022 48.9751 42.3108 26.5856 0.4023 8.4623 5.0079 4.1884 1.3697 2.4079 0.3768 0.8844 0.3450 1.4333 0.2299 0.1057 0.2155 0.9803 16.1903 7.8714 6.4990 55.1805 13.7668 1.0084 11.6483 13.9479 0.5872 1.4810 5.7708 1.4450 0.4691 2.0388 2.3653 0.1077 0.1987 1.1149 1.0363 0.2212 0.7185 0.6100 0.3506 0.2805 2.8184 1.6892 3.5822 2.5054 5.6209 1.9193 2.6539 4.2790 0.6515 1.0239 31.9521 18.6048 14.4260 15.0776 0.3386 1.0413 0.4799 0.3710 0.2414 0.2499 0.0306 1.3688 1.2193 5.4972 4.5338 0.4736 4.2050 2.8563 7.4438 5.1862 53.4642 9.3389 11.8732 0.5628 0.7729 3.8649 2.0175 1.9665 10.0565 3.0245 4.4705 4.5052 22.4846 221.8836 172.4656 29.5961 68.6771 0.5883 3.8639 0.1028 12.0835 0.3982 14.4993 8.5951 6.6176 26.3418 9.3842 3.2132 301.5262 7.3348 58.4071 55.3552 108.4376 76.0084 57.5115 7.0885 5.2049
temp: 298.150 k
press: 1.00000 atm
elementType: 8 8 6 6 6 6 6 6 6 6 6 6 6 6 6 6 6 6 6 1 1 1 1 1 1 1 1 1 1 1 1 1 1 1 1 1 1 1 1 1 1 1 1 1 1 1 1 1 1 1 1 1 1 1 1
symmnumber: 1
zpe: 1313075.0 jmol-1
zpe.correction: 0.500124 hartree
zpe.thermalcorrener: 0.526195 hartree
zpe.thermalcorrenthalpy: 0.527140 hartree
zpe.thermalcorrgfe: 0.439530 hartree
zpe.sumelectzpe: -818.224908 hartree
zpe.sumelectthermal: -818.198837 hartree
zpe.sumelectthermalent: -818.197893 hartree
zpe.sumelectthermalfe: -818.285502 hartree
dipole: -0.4828 -0.3086 -0.1872
dipole: 0.6028
quadrupole: -135.6465 -128.4032 -118.3767
quadrupole: 0.6537 -2.6239 6.0726
quadrupole: -8.1711 -0.9278 9.0988 0.6537 -2.6239 6.0726
hfenergy: -818.7250321 hartree
pointgroup: C01 [X(C17H36O2)]
dipole: 0.1907452 0.1231833 -0.068448 debye
polarizability: 254.065085|-4.5559328|171.4640737|1.2482886|-3.5412185|159.7354307 unknown
InChI: InChI=1S/C17H36O2/c1-16(2)13-11-9-7-5-3-4-6-8-10-12-14-17(19)15-18/h16-19H,3-15H2,1-2H3
charge 0 multiplicity 1
55 atoms
O  -8.978977 1.385567 0.218507
O  -7.641001 -2.137435 -0.074373
C  1.143419 0.373797 -0.258171
C  2.397448 -0.461174 0.085746
C  -0.184011 -0.325714 0.111796
C  3.722207 0.265255 -0.239596
C  -1.433569 0.510277 -0.24572
C  4.979941 -0.569268 0.091407
C  -2.762881 -0.159389 0.169266
C  6.302203 0.176285 -0.201209
C  -4.007384 0.679811 -0.197506
C  7.557047 -0.662706 0.131565
C  -5.336098 0.024284 0.2416
C  8.909684 0.010599 -0.227415
C  -6.56504 0.891301 -0.122779
C  -7.926501 0.346746 0.351756
C  9.155391 1.300256 0.593161
C  10.078404 -0.984351 -0.030063
C  -8.422664 -0.926551 -0.378111
H  1.145192 0.607042 -1.34373
H  1.198967 1.34988 0.268301
H  2.379655 -0.721281 1.165079
H  2.360813 -1.423878 -0.465961
H  -0.189441 -0.545401 1.200198
H  -0.238925 -1.307671 -0.403203
H  3.759851 1.221965 0.322722
H  3.736433 0.537898 -1.315887
H  -1.445041 0.701973 -1.339299
H  -1.358896 1.505028 0.242222
H  4.954841 -0.860809 1.162609
H  4.955755 -1.516102 -0.487898
H  -2.839094 -1.157314 -0.310662
H  -2.753578 -0.341561 1.26453
H  6.329796 0.465483 -1.273238
H  6.31368 1.121646 0.377753
H  -3.92048 1.685346 0.266131
H  -4.025002 0.844613 -1.295591
H  7.489447 -1.630731 -0.408563
H  7.557833 -0.910946 1.214856
H  -5.435119 -0.977006 -0.215446
H  -5.315479 -0.132013 1.341068
H  8.872661 0.289253 -1.303041
H  -6.599703 1.031547 -1.226092
H  -6.441551 1.899012 0.323335
H  -7.896203 0.157108 1.442578
H  9.162286 1.072987 1.677349
H  10.132389 1.751277 0.336955
H  8.375964 2.061631 0.410664
H  10.149617 -1.296803 1.030167
H  9.938369 -1.895517 -0.6417
H  11.046221 -0.529016 -0.31241
H  -8.324591 -0.805787 -1.472394
H  -9.494445 -1.07011 -0.129641
H  -8.952688 1.736495 -0.709037
H  -7.746351 -2.351628 0.886815
