program: Gaussian 09
title: 000191881
version: EM64L-G09RevD.01
frameworkgroup: C1[X(C8H13BrN2O2)]
method: RPBEPBE
basis: SDD
operation: Freq
keyword: #p
keyword: freq=noraman
keyword: PBEPBE/SDD
title: #p freq=noraman PBEPBE/SDD
converged: YES YES NO NO
title: Mulliken charges:
elementType: Br O O N N C C C C C C C C H H H H H H H H H H H H H
charge: 0.019380 -0.374286 -0.247677 -0.122305 0.009554 -0.004176 -0.390277 -0.071608 -0.726573 -0.716919 -0.218675 0.324118 -0.765766 0.229388 0.232929 0.215639 0.301662 0.201960 0.250780 0.220558 0.220719 0.206050 0.218863 0.311297 0.293972 0.381392
chargesum: 0.00000
title: Mulliken charges with hydrogens summed into heavy atoms:
elementType: Br O O N N C C C C C C C C
charge: 0.019380 0.007106 -0.247677 -0.122305 0.009554 0.225212 0.058291 0.230054 -0.053274 -0.071286 -0.218675 0.324118 -0.160497
polarizability: 1.28597345e+02 -1.73278771e+01 1.23366074e+02 -2.02036724e+00 1.36342469e+00 1.04179644e+02
1716.lowfreq: -9.8006 -3.5957 -0.0008 -0.0006 -0.0005 9.5944 20.0410 34.5520 52.1135
frequency: 19.2243 34.4615 52.0890 73.3274 82.0822 107.5419 111.8992 159.2941 175.2743 209.1412 219.4111 240.2400 275.2563 319.9963 337.8081 368.8901 389.1781 399.1374 422.4642 459.4988 493.5326 546.2358 558.8019 594.5683 705.0253 710.3342 819.1584 871.6028 885.6078 916.4416 927.5244 953.3746 960.7717 1002.3406 1011.0556 1069.9853 1121.5383 1133.2451 1146.9495 1177.1202 1221.4024 1225.6169 1258.1959 1287.3190 1290.6598 1305.7649 1337.9655 1348.4586 1383.5008 1401.3001 1405.1897 1424.0598 1449.3801 1467.3057 1474.6917 1481.5724 1498.8238 1582.1208 2191.2454 2969.7054 2972.3561 2980.9835 2993.8097 3023.3763 3058.3586 3062.6158 3071.0559 3074.9505 3078.8416 3086.3138 3181.7258 3432.5002
redmass: 4.0651 6.3911 4.5973 6.4582 3.8028 6.6134 6.2258 9.7346 2.7512 1.1829 2.4572 1.4844 3.6733 2.9678 4.4827 2.8283 1.2509 1.9976 2.7125 4.7752 6.7945 5.1481 5.3994 4.4183 3.6069 7.0951 2.9644 1.9286 1.6597 2.5854 1.3602 1.9586 1.5686 3.2795 2.3988 2.7109 1.7203 1.9508 2.1654 1.8136 1.3162 1.1790 1.2591 1.6886 1.3022 1.2977 1.3550 1.4477 1.2038 1.2164 2.2987 1.1351 1.0837 1.0539 1.0461 1.0581 1.0456 9.9397 12.5639 1.0362 1.0388 1.0774 1.0647 1.0825 1.1005 1.0992 1.0989 1.0998 1.0989 1.0557 1.1121 1.0682
irintensity: 1.5394 1.3276 0.9516 4.9176 1.6844 5.3910 0.8524 4.2269 3.3608 1.0204 2.7953 2.5340 7.0455 2.0587 21.9489 0.8744 102.3534 27.8478 17.7340 6.0452 26.4328 1.6196 14.9987 37.6332 3.6005 2.4415 4.9776 10.7589 6.2836 5.9421 6.0440 8.3822 2.1592 8.4079 9.3512 1.7847 30.4686 2.1963 37.9466 9.8968 6.6535 12.7307 12.7082 54.2781 41.7851 1.6947 3.4540 4.7131 20.9340 28.5960 108.5493 28.2064 2.3686 6.2592 8.9789 4.2120 21.5328 171.7117 7.2590 28.8437 24.3043 4.9807 28.6209 10.5300 1.5693 10.9576 65.4900 15.6026 54.1390 7.8789 0.4600 16.0649
temp: 298.150 k
press: 1.00000 atm
elementType: 35 8 8 7 7 6 6 6 6 6 6 6 6 1 1 1 1 1 1 1 1 1 1 1 1 1
symmnumber: 1
zpe: 532832.2 jmol-1
zpe.correction: 0.202945 hartree
zpe.thermalcorrener: 0.218614 hartree
zpe.thermalcorrenthalpy: 0.219558 hartree
zpe.thermalcorrgfe: 0.157432 hartree
zpe.sumelectzpe: -584.973421 hartree
zpe.sumelectthermal: -584.957752 hartree
zpe.sumelectthermalent: -584.956807 hartree
zpe.sumelectthermalfe: -585.018934 hartree
dipole: -0.5371 0.0747 -1.2766
dipole: 1.3870
quadrupole: -97.4815 -85.0912 -93.7435
quadrupole: 14.2055 1.0391 0.5732
quadrupole: -5.3761 7.0143 -1.6381 14.2055 1.0391 0.5732
hfenergy: -585.1763659 hartree
pointgroup: C01 [X(C8H13Br1N2O2)]
dipole: 0.0515441 0.0663114 0.5391989 debye
dipolederiv: -0.1989602 -0.0113527 -0.039355 -0.1068794 -0.2720428 -0.1248265 -0.1155228 -0.1178738 -0.1748077 -0.5733941 -0.0703885 -0.0116445 -0.0266475 0.0139284 0.1665062 0.022863 0.2381062 -0.4523991 -0.6250745 -0.1098333 -0.0770737 -0.1158477 -0.4323698 0.1900899 0.2679813 0.2314289 -0.9364937 -0.648849 -0.3054083 0.3136176 -0.2502982 -0.560856 0.0287966 0.1036228 -0.1330899 0.0827391 -0.1950384 -0.0499718 -0.0200569 -0.0405131 -0.3150927 -0.0350342 0.0135969 0.0524588 -0.2091132 0.0781056 0.0533963 0.0133289 -0.0175081 0.1421368 -0.0153041 0.041112 -0.0862318 0.106362 0.0150586 -0.1219908 0.0367875 -0.0766725 -0.0167833 0.0148546 -0.0301455 0.0363975 0.0767328 0.568012 0.0705056 0.0504289 0.0685653 0.3002964 0.020186 0.2474429 0.2003735 0.1268376 0.0771019 0.008954 0.0601547 0.0361677 -0.023428 0.0053897 0.0282573 0.0365218 -0.1082887 0.0781646 0.0074101 0.0396253 0.0660309 -0.0380494 -0.0303677 0.0403627 0.0017355 0.0223661 -0.1486518 0.1589798 -0.0163971 0.0981841 0.1238834 0.0105141 -0.0572149 -0.0843943 -0.057616 1.1159526 0.6008769 -0.1011735 0.4599039 0.4154058 -0.3888656 -0.3935925 -0.3537158 1.0131362 -0.0109598 -0.0754987 -0.1090455 -0.0112796 0.4386926 0.1658399 -0.0523828 0.1726496 0.1041879 -0.1139981 -0.0220144 -0.0496205 -0.0220818 0.0354713 -0.002257 -0.0564068 0.0102762 -0.0073203 0.1005729 0.0077823 -0.0032132 0.0119379 0.0223973 0.0483721 0.0390604 0.0433985 -0.0995257 -0.126912 -0.0651164 -0.0538969 0.0195622 0.0616001 -0.0162844 -0.0618743 -0.0363518 0.0566094 0.1179112 -0.0125843 0.0264266 -0.0120285 0.140736 0.0118645 -0.0438281 -0.0542469 0.0467192 -0.1340825 -0.0359983 -0.1202457 -0.0761151 0.0770286 -0.0239316 -0.0406382 0.0015872 0.0375587 0.0114989 0.0629957 0.0880281 0.0681302 0.0450722 -0.0900008 0.0806519 -0.0832989 0.0245605 0.0898918 -0.0314701 -0.0082625 -0.0214959 -0.1717822 0.078816 -0.0092856 0.0194479 0.0774329 0.0625335 -0.0507422 0.016013 -0.0075102 -0.1807431 0.0105307 0.0219309 0.0405944 0.0861689 -0.1500709 0.0076148 -0.0375281 -0.0642579 0.0753885 -0.0297805 -0.0962405 -0.0188243 0.0548787 0.0760957 0.0128305 -0.0154279 0.0067867 0.0819428 0.0711853 0.0141124 0.0226035 -0.1709946 0.0282345 -0.0151936 0.0185261 -0.0101403 0.0162755 -0.0700202 0.0757906 -0.0595988 0.0170116 0.1036537 -0.0233926 -0.0108873 0.0424957 -0.0774119 0.0353983 -0.0625641 -0.0058459 0.0314102 0.403204 0.00961 0.0108915 -0.0184891 0.0983036 -0.0316712 0.0229109 -0.0741072 0.2518471 unknown
polarizability: 115.078472|13.6616454|136.3754376|2.6352416|4.1202084|104.6891538 unknown
InChI: InChI=1S/C8H13BrN2O2/c1-6(2)3-7(5-10)11(13)8(12)4-9/h6-7,13H,3-4H2,1-2H3
charge 0 multiplicity 1
26 atoms
Br 2.858938 1.759044 1.390743
O  0.681848 -1.004805 1.652629
O  1.55878 0.163088 -1.649677
N  0.59628 -0.797618 0.221031
N  -1.700439 -3.347756 -0.037622
C  -1.386786 1.654053 -0.011046
C  -1.750846 0.173475 0.275797
C  -0.770371 -0.85994 -0.35499
C  -1.451822 1.993873 -1.519773
C  -2.334499 2.568555 0.801783
C  -1.283394 -2.241617 -0.198067
C  1.663994 -0.180356 -0.434355
C  2.937733 0.008816 0.368837
H  -0.352078 1.836487 0.344246
H  -1.783797 -0.004291 1.366807
H  -2.761904 -0.040419 -0.124462
H  -0.628819 -0.646324 -1.431889
H  -2.450203 1.753937 -1.935131
H  -0.684943 1.453512 -2.103093
H  -1.273664 3.073194 -1.676887
H  -2.077732 3.632111 0.647272
H  -3.386719 2.426801 0.487291
H  -2.2705 2.357636 1.885469
H  3.785382 0.113415 -0.320333
H  3.101818 -0.762245 1.132215
H  0.646645 -1.997228 1.773108
