program: Gaussian 09
title: 000191860
version: EM64L-G09RevD.01
frameworkgroup: C1[X(C20H24O2)]
method: RPBEPBE
basis: SDD
operation: Freq
keyword: #pfreq=noraman
keyword: PBEPBE/SDD
title: #p freq=noraman PBEPBE/SDD
converged: YES YES NO NO
title: Mulliken charges:
elementType: O O C C C C C C C C C C C C C C C C C C C C H H H H H H H H H H H H H H H H H H H H H H H H
charge: -0.457714 -0.438422 0.298613 -0.199402 -0.099760 0.086507 -0.165839 -0.505848 -0.475417 -0.482395 -0.555551 -0.493941 -0.798151 0.260043 -0.584094 0.319506 0.231407 -0.352236 -0.582981 -0.410288 0.290549 -0.545321 0.255721 0.220923 0.201390 0.212010 0.221571 0.222298 0.219544 0.220091 0.197569 0.219856 0.241847 0.211771 0.218444 0.221754 0.209748 0.253336 0.221915 0.221529 0.339065 0.222055 0.222939 0.248349 0.286305 0.350709
chargesum: 0.00000
title: Mulliken charges with hydrogens summed into heavy atoms:
elementType: O O C C C C C C C C C C C C C C C C C C C C
charge: -0.118649 -0.087713 0.298613 0.056318 0.121164 0.086507 0.035551 -0.072267 -0.033576 -0.064736 -0.093848 -0.063726 -0.113313 0.260043 -0.140650 0.319506 0.231407 -0.130181 -0.360041 -0.161940 0.290549 -0.259016
polarizability: 2.87118473e+02 1.29210717e+01 2.08310636e+02 6.22320712e+00 7.26608976e+00 1.43080533e+02
1716.lowfreq: -13.6393 -0.0007 -0.0006 -0.0005 0.4743 7.1776 32.2799 56.3255 69.3927
frequency: 31.2933 56.2413 69.3842 92.5336 103.5449 147.5838 152.0609 166.6372 174.8648 183.8285 213.0800 218.0936 246.7376 251.1653 260.7256 282.7700 319.6809 339.9539 353.7002 367.1245 372.3591 389.9389 397.1056 416.0338 440.2870 444.4972 459.4998 480.7565 492.4078 528.3609 553.0309 560.6927 579.3284 598.9831 620.3564 628.0176 634.4499 656.5878 699.8950 711.7683 727.6673 764.4898 789.4424 809.1334 825.5624 835.1034 844.7714 853.6050 864.4327 901.8606 918.8456 933.4885 950.1239 955.6665 969.3976 990.4022 1003.7069 1011.8391 1015.2999 1034.2149 1055.2448 1061.8632 1082.2657 1089.3466 1110.8528 1127.9937 1130.7483 1135.0191 1145.1027 1153.8611 1175.1202 1177.5045 1190.7183 1205.0630 1215.3374 1217.0796 1238.0147 1248.4508 1256.7589 1265.5170 1271.2480 1281.8922 1287.1675 1293.3506 1297.2410 1311.3472 1326.5668 1327.2913 1336.4319 1340.5455 1350.0504 1354.3856 1366.2547 1383.2054 1386.8803 1427.5930 1454.2025 1459.5445 1459.7197 1467.1560 1468.9961 1473.1495 1480.0587 1484.6662 1500.4318 1601.6151 1619.7753 2126.4033 2910.4252 2937.9787 2953.8618 2971.8044 2977.0413 2982.7925 2987.3442 2990.7314 3001.6484 3013.4747 3016.2001 3032.8442 3033.8797 3044.2971 3052.9921 3072.2479 3076.8602 3090.2861 3103.2643 3138.5509 3170.2820 3428.3707 3555.2596 3579.8773
redmass: 4.3893 4.0411 4.9998 2.8449 3.3361 3.9822 2.4482 2.2232 1.5544 2.9214 2.9013 4.2417 1.5250 2.2060 1.9804 3.1121 3.2938 2.6826 1.1212 3.3315 3.2060 3.8097 3.9188 3.6825 3.6572 2.9444 4.2507 2.9207 3.9885 4.5999 3.4911 3.3863 4.8636 3.7039 3.2597 2.3172 1.5428 1.2446 2.7106 4.3870 3.8923 1.9077 2.0834 2.1314 1.5118 2.1210 1.6969 2.6934 1.9398 2.7925 2.0967 2.4387 1.5090 1.7418 2.1928 2.1472 2.7372 1.9516 2.4146 2.6533 2.2021 2.1514 2.5165 2.0778 2.1183 1.6080 1.5927 1.6720 1.8564 2.3074 1.4654 1.7363 1.3986 1.9226 1.2211 1.7870 1.7048 1.5284 1.6058 1.5734 1.6064 1.4409 1.4262 1.3470 1.3098 1.5290 1.4220 1.5536 1.5963 1.4835 1.4497 1.5691 1.5590 4.5458 1.2271 3.3899 1.1211 1.0751 1.0781 1.0772 1.0928 1.0675 1.0860 1.0645 2.7613 6.6145 6.6457 6.0797 1.0789 1.0823 1.0639 1.0613 1.0601 1.0590 1.0432 1.0820 1.0595 1.0944 1.0632 1.1027 1.0975 1.1022 1.1021 1.0975 1.1034 1.0907 1.0985 1.0873 1.0958 1.1581 1.0662 1.0659
irintensity: 0.1646 1.1240 0.3679 0.1039 0.0586 0.0183 0.3852 0.3165 0.5242 0.1213 0.1265 1.1285 75.8742 13.6211 34.3470 6.2551 10.5375 2.4610 138.3730 9.7877 0.5196 3.4191 5.8885 0.9188 1.2097 14.1836 20.1815 1.7273 1.1112 1.2665 4.5235 1.2494 6.1740 2.3025 2.2323 15.7802 63.5440 60.7158 1.0360 5.3935 2.0137 6.0210 8.9897 2.0501 6.4312 22.9751 24.8688 15.9850 23.7818 31.0055 30.9407 12.7318 2.3122 4.3884 8.2518 30.9290 1.0078 4.5874 0.6119 10.6142 2.0665 3.1836 11.1866 2.4609 3.5481 3.7020 7.7880 229.3375 40.7074 11.0484 19.6359 4.4840 8.2808 1.4754 10.8618 3.0204 5.7634 3.5032 11.8594 11.2005 10.9114 12.9661 1.2506 1.3256 1.9861 16.9055 1.9422 1.8906 3.1867 2.7889 3.0323 2.8905 6.0971 8.6772 23.2328 41.4113 9.2669 0.0845 6.2534 14.4257 4.1854 2.6258 8.7897 17.4059 86.7476 9.4749 65.4987 4.4636 11.0724 24.4732 31.1414 41.3141 33.3408 15.7600 34.0818 15.5479 35.9257 39.3956 30.7858 46.3536 33.1672 56.6502 1.6138 38.5302 52.3234 26.6284 15.8418 12.7020 11.0048 75.6625 5.0075 36.3820
temp: 298.150 k
press: 1.00000 atm
elementType: 8 8 6 6 6 6 6 6 6 6 6 6 6 6 6 6 6 6 6 6 6 6 1 1 1 1 1 1 1 1 1 1 1 1 1 1 1 1 1 1 1 1 1 1 1 1
symmnumber: 1
zpe: 1017039.7 jmol-1
zpe.correction: 0.387370 hartree
zpe.thermalcorrener: 0.407668 hartree
zpe.thermalcorrenthalpy: 0.408612 hartree
zpe.thermalcorrgfe: 0.340325 hartree
zpe.sumelectzpe: -925.285174 hartree
zpe.sumelectthermal: -925.264876 hartree
zpe.sumelectthermalent: -925.263931 hartree
zpe.sumelectthermalfe: -925.332219 hartree
dipole: -1.1512 1.6659 -0.8810
dipole: 2.2083
quadrupole: -124.9484 -124.4077 -134.5772
quadrupole: 14.0904 8.5187 0.7443
quadrupole: 3.0294 3.5701 -6.5994 14.0904 8.5187 0.7443
hfenergy: -925.6725438 hartree
pointgroup: C01 [X(C20H24O2)]
dipole: 0.4518495 -0.6579063 -0.3432583 debye
polarizability: 287.1998366|12.7160634|208.1889153|-6.069179|-7.4936086|143.1208897 unknown
InChI: InChI=1S/C20H24O2/c1-3-20(22)11-9-18-17-6-4-13-12-14(21)5-7-15(13)16(17)8-10-19(18,20)2/h1,5,7,12,16-18,21-22H,4,6,8-11H2,2H3
charge 0 multiplicity 1
46 atoms
O  4.327362 -1.192036 0.705893
O  -6.385345 0.630262 0.053608
C  2.300715 0.158925 0.552959
C  1.507609 -1.11825 0.112706
C  -0.019745 -0.990426 0.32978
C  3.699165 -0.115833 -0.116282
C  -0.612096 0.280182 -0.337412
C  1.652559 1.433496 -0.068672
C  1.970581 -1.407315 -1.352241
C  0.132061 1.532503 0.199526
C  3.34605 -0.69123 -1.524319
C  -0.798156 -2.244994 -0.12118
C  2.420635 0.309366 2.084535
C  -2.140984 0.340385 -0.189973
C  -2.250475 -2.172767 0.391664
C  -2.907127 -0.819891 0.124625
C  4.603173 1.046388 -0.167665
C  -2.84026 1.555904 -0.422958
C  -4.319457 -0.729903 0.207837
C  -4.241389 1.64973 -0.340685
C  -4.984481 0.493406 -0.017861
C  5.394757 1.990773 -0.209034
H  1.86897 -1.953064 0.745394
H  -0.182091 -0.885499 1.426383
H  -0.393791 0.222402 -1.429011
H  1.806552 1.443554 -1.16627
H  2.165497 2.330475 0.327643
H  1.244689 -1.016164 -2.088371
H  2.052289 -2.493346 -1.529112
H  -0.07521 1.642044 1.282454
H  -0.244807 2.452112 -0.285913
H  4.145175 -1.376635 -1.859614
H  3.288322 0.123101 -2.267937
H  -0.308739 -3.160561 0.265403
H  -0.788842 -2.312666 -1.227617
H  3.07691 1.16186 2.34107
H  1.43362 0.495874 2.543777
H  2.853451 -0.598456 2.534452
H  -2.251768 -2.361166 1.486205
H  -2.863082 -2.977686 -0.059317
H  5.237453 -1.356517 0.348524
H  -2.278842 2.460278 -0.680805
H  -4.898196 -1.633774 0.448612
H  -4.767335 2.591506 -0.522072
H  6.075732 2.820956 -0.242783
H  -6.807907 -0.232805 0.288753
