program: Gaussian 09
title: 000191846
version: EM64L-G09RevD.01
frameworkgroup: C1[X(C23H33NO3)]
method: RPBEPBE
basis: SDD
operation: Freq
keyword: #p
keyword: freq=noraman
keyword: PBEPBE/SDD
title: #p freq=noraman PBEPBE/SDD
converged: YES YES NO NO
title: Mulliken charges:
elementType: O O O N C C C C C C C C C C C C C C C C C C C C C C C H H H H H H H H H H H H H H H H H H H H H H H H H H H H H H H H H
charge: -0.456973 -0.417821 -0.230568 -0.487826 -0.574718 0.219979 -0.376860 -0.368805 0.213377 0.136006 -0.363235 0.209107 -0.380431 -0.455258 -0.147053 -0.371437 -0.337245 -0.355507 -0.422813 -0.167360 -0.369611 -0.488806 -0.346510 -0.257244 -0.222502 -0.688184 0.170727 0.207162 0.217134 0.215247 0.201919 0.190322 0.196860 0.189343 0.196722 0.311032 0.218848 0.219842 0.181546 0.221430 0.204994 0.194082 0.216217 0.218980 0.189191 0.188447 0.226875 0.231735 0.230946 0.253635 0.250850 0.192039 0.195137 0.219283 0.220474 0.212572 0.206429 0.210719 0.332199 0.375358
chargesum: 0.00000
title: Mulliken charges with hydrogens summed into heavy atoms:
elementType: O O O N C C C C C C C C C C C C C C C C C C C C C C C
charge: -0.124774 -0.042462 -0.230568 -0.176794 -0.150422 0.219979 0.040306 0.018376 0.213377 0.136006 0.022830 0.209107 0.058260 -0.052282 0.057940 0.038863 -0.118265 0.022132 -0.191078 0.059515 -0.138666 0.015680 0.040667 -0.037961 -0.002028 -0.058464 0.170727
polarizability: 3.06671303e+02 -1.90221604e+01 3.73151766e+02 2.41898700e+01 -8.10122420e+00 1.87630373e+02
1716.lowfreq: -29.5126 -9.4727 -5.0648 -3.0338 -0.0007 -0.0003 -0.0003 5.2462 11.4397
frequency: -27.7722 -6.5038 11.1739 19.1380 25.2477 31.0478 38.0567 40.7228 53.8067 62.7504 74.6864 80.1249 84.4250 87.4110 116.2841 123.2696 131.2952 146.7068 169.4510 178.3353 203.8713 206.9772 223.8595 234.6772 247.0430 255.3850 267.2637 287.1305 306.0256 334.4676 341.3714 380.2594 388.0517 417.8047 433.2932 454.1781 475.4525 494.0016 499.5838 506.5098 512.6048 540.5722 574.9367 585.7815 588.3581 590.6487 638.3621 673.8270 698.5719 719.0915 723.2813 731.9751 743.4653 749.2360 759.1180 769.0588 781.4500 827.3823 840.0668 849.9941 851.1950 857.2553 865.2681 882.4021 908.8023 917.8269 930.5279 945.1379 958.8386 966.9418 969.3972 974.8971 987.6140 1009.8825 1013.7912 1024.0460 1037.7858 1042.2883 1062.6785 1067.3066 1079.8589 1090.1733 1091.5252 1096.5280 1109.5415 1110.2776 1115.7523 1127.2704 1138.0347 1166.5718 1192.8581 1204.4010 1209.6108 1214.1017 1227.8180 1235.5250 1241.2062 1244.1145 1258.1830 1262.8401 1267.8182 1274.9335 1276.4558 1279.4681 1286.2478 1288.3927 1292.1977 1295.5663 1304.7991 1311.6256 1328.0702 1329.6300 1338.4311 1339.4153 1351.4989 1353.6889 1357.3795 1370.6834 1386.8410 1388.4474 1413.1693 1434.6695 1440.0962 1456.2084 1457.7649 1460.0899 1463.1900 1464.6307 1466.7124 1470.0905 1475.0595 1477.8793 1479.2006 1483.1608 1485.5013 1488.4423 1546.1648 1583.6808 1626.4418 1667.3099 1669.1053 2945.9760 2948.9229 2953.6126 2954.3536 2959.2755 2964.5536 2965.5868 2969.5835 2974.3332 2974.8689 2984.6758 2986.5450 2992.7664 2993.6831 3003.7391 3014.7704 3016.8474 3026.7645 3029.2841 3039.1563 3043.0658 3059.9896 3063.7071 3068.6798 3093.5297 3106.1339 3122.2630 3129.8732 3143.7096 3161.7004 3511.0704 3543.2384 3610.3795
redmass: 1.9243 4.3161 8.3169 4.4557 3.5156 4.0012 2.4186 4.1436 2.5789 4.5740 4.4766 2.5124 3.2998 3.6255 2.0828 2.5307 2.0608 5.0981 4.8721 2.7050 2.7399 3.0486 1.2063 4.6404 2.3065 3.8181 2.1364 1.4723 3.6880 3.7449 3.9780 3.8903 2.4816 3.0642 3.3267 3.6903 3.6421 3.6862 1.7868 2.8431 1.2849 4.3547 4.2017 3.6510 4.6260 4.7260 1.3099 5.0072 4.6420 1.0801 1.1504 1.2957 2.2440 1.4884 1.3646 3.1844 1.4552 1.7657 1.7432 1.5405 1.7230 4.2966 2.9903 2.0203 2.1847 2.0947 1.3840 1.5615 1.8146 1.5421 1.3032 1.7349 4.7598 2.2785 3.4568 2.3478 1.8942 2.7664 2.9507 2.6464 2.2225 2.3006 1.9965 2.9852 1.8677 1.7893 1.6836 1.3628 2.1217 1.1041 1.5007 1.4428 1.3899 1.3304 1.2783 1.4071 1.5988 1.7397 1.2826 1.2817 1.2726 1.2228 1.4392 1.0807 1.0978 1.1385 1.0982 1.4591 1.2198 1.4581 2.2019 1.4338 1.4590 1.4476 1.9981 1.6603 1.5543 1.8411 1.5194 1.3207 3.6282 1.0849 3.4577 1.1415 1.0685 1.0789 1.0790 2.3777 1.1696 1.1943 1.0620 1.0641 1.1173 3.1173 1.1038 1.0989 6.6367 6.1009 7.3459 6.2694 8.2234 1.0641 1.0588 1.0632 1.0594 1.0709 1.0680 1.0593 1.0367 1.0604 1.0611 1.0611 1.0965 1.0959 1.0603 1.0995 1.1010 1.1022 1.0970 1.0995 1.1035 1.1044 1.1031 1.0995 1.1001 1.0926 1.0862 1.0847 1.0889 1.0951 1.1001 1.0639 1.0658 1.0801
irintensity: 0.7137 0.1103 0.6513 0.1375 0.0324 0.1924 0.0471 0.0670 0.1276 0.5423 0.5144 0.1994 1.4309 1.2890 0.2167 0.1298 0.0752 1.0280 0.6642 2.4677 1.1349 3.4403 0.5149 1.3637 0.8246 6.1984 27.0575 101.0728 4.1774 2.1531 4.5901 10.8059 0.5887 4.6527 9.2227 17.0426 3.0466 16.5431 27.1175 12.4042 83.3201 3.2435 0.5387 3.0571 15.8515 6.7445 124.0383 3.1999 7.4604 25.8084 11.5225 0.3539 7.6087 88.6035 6.0540 10.7765 1.8764 3.0281 5.1563 0.4306 0.5740 1.5497 4.7628 5.0161 15.2628 1.9690 2.2598 1.0756 139.5746 15.8870 0.3138 17.0629 61.2104 25.7518 49.8081 2.1243 9.4112 134.9286 10.8806 1.3119 12.0271 5.0656 8.6942 28.9657 4.9035 8.7112 25.4260 10.4385 18.5979 3.4015 1.0988 19.8862 10.5772 15.7824 21.0485 16.2519 1.2803 5.2577 4.7507 3.9799 0.6556 4.1880 9.6972 0.1676 0.3564 0.3312 0.1007 2.9724 10.2801 23.2188 54.0195 2.6263 15.1414 4.3815 27.1379 2.5730 2.2238 34.1917 10.8519 9.4017 35.5218 25.7439 14.3121 8.8397 1.9112 0.0005 4.7357 4.0295 1.4016 3.6589 11.3911 4.4191 2.9298 3.2762 3.2531 41.9201 0.1186 1.5316 4.9504 52.6218 204.9245 70.1842 0.5437 11.6973 29.5091 5.7070 57.5661 2.9454 30.7259 35.1172 101.7799 5.2258 1.8326 0.6825 41.2033 9.7475 6.0971 4.9466 48.8078 0.0811 123.2848 51.7803 116.5743 74.2141 59.0583 5.9753 40.6043 2.2933 2.4279 37.0239 40.9586 18.8504 7.7950 41.6153
temp: 298.150 k
press: 1.00000 atm
elementType: 8 8 8 7 6 6 6 6 6 6 6 6 6 6 6 6 6 6 6 6 6 6 6 6 6 6 6 1 1 1 1 1 1 1 1 1 1 1 1 1 1 1 1 1 1 1 1 1 1 1 1 1 1 1 1 1 1 1 1 1
symmnumber: 1
zpe: 1341646.6 jmol-1
zpe.correction: 0.511006 hartree
zpe.thermalcorrener: 0.539349 hartree
zpe.thermalcorrenthalpy: 0.540293 hartree
zpe.thermalcorrgfe: 0.447571 hartree
zpe.sumelectzpe: -1174.618242 hartree
zpe.sumelectthermal: -1174.589899 hartree
zpe.sumelectthermalent: -1174.588955 hartree
zpe.sumelectthermalfe: -1174.681678 hartree
dipole: -0.8741 1.9961 2.3278
dipole: 3.1886
quadrupole: -168.6053 -149.7019 -172.8429
quadrupole: -0.5741 0.1884 0.4786
quadrupole: -4.8886 14.0148 -9.1262 -0.5741 0.1884 0.4786
hfenergy: -1175.1292483 hartree
pointgroup: C01 [X(C23H33N1O3)]
dipole: 0.2686888 0.8922619 -0.8398899 debye
polarizability: 305.2705656|12.2904185|371.9363294|22.3812467|27.3448428|190.2465476 unknown
InChI: InChI=1S/C23H33NO3/c1-2-3-6-11-18(25)16-17-22-20(12-7-4-5-8-15-23(26)27)19-13-9-10-14-21(19)24-22/h9-10,13-14,16-18,24-26H,2-8,11-12,15H2,1H3
charge 0 multiplicity 1
60 atoms
O  -3.906843 4.337233 1.293595
O  8.008071 -0.214992 -1.361136
O  7.422207 -0.47994 0.869126
N  -3.84073 -0.602589 -0.253998
C  -0.440856 -1.388705 1.13683
C  -1.835561 -1.357649 0.561386
C  0.663559 -1.141898 0.068756
C  2.087778 -1.107304 0.664964
C  -2.649072 -0.216927 0.397578
C  -2.55503 -2.47571 -0.012362
C  3.180059 -0.874182 -0.403031
C  -3.813811 -1.975008 -0.508498
C  4.598664 -0.763899 0.197256
C  -2.027451 4.474634 -0.329101
C  -2.659303 3.670476 0.843756
C  -0.714887 3.878456 -0.89083
C  -2.361073 1.152549 0.785809
C  0.469815 3.853401 0.104155
C  -2.261577 -3.8592 -0.153882
C  -3.061601 2.2748 0.443467
C  -4.770642 -2.813185 -1.120782
C  5.669072 -0.540968 -0.887744
C  1.767359 3.305716 -0.533616
C  -3.210691 -4.699147 -0.767354
C  -4.452282 -4.181653 -1.244866
C  2.950985 3.239604 0.455166
C  7.073058 -0.418609 -0.329719
H  -0.332707 -0.629086 1.936545
H  -0.258212 -2.369296 1.619268
H  0.597654 -1.929247 -0.70859
H  0.45453 -0.180966 -0.444422
H  2.146146 -0.303089 1.428721
H  2.290971 -2.05865 1.199494
H  2.944374 0.053992 -0.96565
H  3.149903 -1.702109 -1.141919
H  -4.627724 0.017048 -0.432057
H  4.634265 0.069473 0.925047
H  4.839876 -1.680167 0.769476
H  -1.834634 5.511221 0.02656
H  -2.783493 4.545847 -1.136036
H  -1.937631 3.627301 1.686837
H  -0.416051 4.468052 -1.781322
H  -0.911029 2.848144 -1.248524
H  -1.467613 1.269337 1.414237
H  0.652713 4.878408 0.49036
H  0.216208 3.229964 0.986093
H  -3.955894 2.230364 -0.195671
H  -1.312303 -4.267766 0.211431
H  -5.725433 -2.422407 -1.489983
H  5.6684 -1.368702 -1.624111
H  5.457015 0.375249 -1.473971
H  1.567263 2.292876 -0.941386
H  2.041386 3.939843 -1.401623
H  -2.999175 -5.768133 -0.881923
H  -5.170938 -4.861042 -1.716932
H  3.18376 4.24048 0.864861
H  2.719602 2.574244 1.308933
H  3.866209 2.855013 -0.0326
H  -3.719676 5.303607 1.417231
H  8.918222 -0.140007 -0.963696
