program: Gaussian 09
title: 000191840
version: EM64L-G09RevD.01
frameworkgroup: C1[X(C10H10N4O4)]
method: RPBEPBE
basis: SDD
operation: Freq
keyword: #p
keyword: freq=noraman
keyword: PBEPBE/SDD
title: #p freq=noraman PBEPBE/SDD
converged: YES YES NO NO
title: Mulliken charges:
elementType: O O O O N N N N C C C C C C C C C C H H H H H H H H H H
charge: -0.259408 -0.247004 -0.169014 -0.138897 -0.160953 -0.166754 -0.220624 -0.082998 0.135580 0.097805 0.168378 0.141279 0.209468 -0.623485 -0.612295 -0.596653 0.039433 -0.125276 0.263069 0.287825 0.263036 0.275703 0.251059 0.251043 0.270939 0.256824 0.257125 0.234797
chargesum: 0.00000
title: Mulliken charges with hydrogens summed into heavy atoms:
elementType: O O O O N N N N C C C C C C C C C C
charge: -0.259408 -0.247004 -0.169014 -0.138897 -0.160953 -0.166754 -0.220624 -0.082998 0.135580 0.097805 0.168378 0.141279 0.209468 0.190444 0.165511 0.188234 0.039433 0.109521
polarizability: 2.67849491e+02 1.74259491e+00 1.63468572e+02 4.74581394e-02 -9.92656079e-03 7.08646550e+01
1716.lowfreq: -6.0616 -0.0006 -0.0005 0.0003 1.9287 9.0681 40.8086 63.7294 92.3852
frequency: 40.7837 63.7293 92.3819 95.3054 105.3863 105.4559 110.9089 123.4909 131.8490 153.9664 208.8464 226.3570 254.4004 264.7926 288.6713 308.6400 326.1173 337.3369 375.2398 390.6013 390.9124 435.4131 463.3236 513.0621 526.9646 571.8900 653.7340 671.9751 702.3642 711.2959 719.6499 753.5615 778.0431 819.2046 911.7318 958.0570 968.7431 976.7550 1038.4882 1055.0918 1127.5784 1128.6451 1132.5474 1164.4909 1184.6413 1219.8998 1232.6546 1262.1337 1293.8394 1313.9824 1353.6204 1382.3925 1416.0880 1420.1953 1426.1186 1452.7694 1472.8698 1473.0286 1475.8410 1476.6822 1480.0881 1482.3328 1507.0368 1560.0355 1572.5937 1609.1534 1632.7018 1640.0732 2968.8365 3010.6710 3017.3416 3019.2777 3101.7689 3110.9086 3120.1318 3139.0310 3142.7876 3145.6960
redmass: 7.9701 6.8695 3.4146 3.8618 1.7640 2.0058 1.1876 2.9033 2.9107 1.1024 6.0542 5.7359 5.2976 4.4503 2.9611 5.6588 11.4591 4.0785 5.1193 9.3877 8.0569 7.7800 7.5091 7.3207 4.9957 6.1167 10.4472 9.1194 9.9901 8.6052 6.1922 11.3829 5.4631 7.2137 4.9477 6.9909 1.9535 2.9902 2.4468 2.7898 1.3174 1.3082 1.2992 2.9905 4.9651 3.4897 2.9739 6.8793 7.3371 4.4212 1.3616 3.9188 2.5030 1.2383 1.3295 1.5787 1.2515 1.0445 1.0883 1.0420 1.0418 1.2637 3.1702 10.6571 7.9024 10.7741 8.6528 9.1908 1.0896 1.0336 1.0329 1.0324 1.1028 1.1023 1.1018 1.1056 1.1013 1.1026
irintensity: 1.2033 2.7429 0.4179 12.8093 1.3930 1.6272 0.1332 0.7118 19.8902 0.2591 3.5066 11.9136 1.7270 3.2514 0.3936 0.7350 7.0831 12.3466 9.4580 19.6386 0.3297 21.7711 10.6952 10.2089 3.8883 1.1520 1.6982 14.5885 4.7820 6.9832 12.6322 9.6039 10.6000 36.3719 10.3944 27.8032 5.3059 7.4201 52.2766 20.2288 0.6402 0.0885 0.1568 28.2686 31.3768 39.7462 4.4869 58.8385 209.4880 25.0176 6.4028 68.9055 118.3139 7.9070 35.4500 64.7969 38.8688 12.0442 11.5386 28.3489 17.9148 30.9443 23.4027 697.0260 32.9487 712.9812 17.1156 261.5453 31.3340 25.5971 22.2756 9.2426 15.0381 13.0328 6.0849 2.7689 0.2530 1.1003
temp: 298.150 k
press: 1.00000 atm
elementType: 8 8 8 8 7 7 7 7 6 6 6 6 6 6 6 6 6 6 1 1 1 1 1 1 1 1 1 1
symmnumber: 1
zpe: 528121.4 jmol-1
zpe.correction: 0.201151 hartree
zpe.thermalcorrener: 0.218357 hartree
zpe.thermalcorrenthalpy: 0.219301 hartree
zpe.thermalcorrgfe: 0.155860 hartree
zpe.sumelectzpe: -905.672712 hartree
zpe.sumelectthermal: -905.655506 hartree
zpe.sumelectthermalent: -905.654561 hartree
zpe.sumelectthermalfe: -905.718002 hartree
dipole: 3.4003 0.3287 0.0001
dipole: 3.4161
quadrupole: -140.3841 -103.7094 -100.3150
quadrupole: -1.1878 0.0047 0.0027
quadrupole: -25.5813 11.0935 14.4878 -1.1878 0.0047 0.0027
hfenergy: -905.8738627 hartree
pointgroup: C01 [X(C10H10N4O4)]
dipole: -1.336039 -0.1429634 0.03037 debye
polarizability: 267.6630246|2.9154984|163.3677163|-5.2380844|3.6205423|71.1519775 unknown
InChI: InChI=1S/C10H10N4O4/c1-12-6-8(11-7(12)5(16)4-15)13(2)10(18)14(3)9(6)17/h4H,1-3H3
charge 0 multiplicity 1
28 atoms
O  -1.919175 2.626084 0.112514
O  -3.724102 -1.722358 -0.014718
O  3.822713 1.316033 -0.099394
O  5.173763 -1.212694 -0.229264
N  0.860597 1.227202 -0.021437
N  -1.38684 -1.538454 -0.071251
N  -2.795114 0.42833 0.048065
N  1.029954 -1.066345 -0.116847
C  -0.42996 0.712739 -0.006313
C  -0.289829 -0.694737 -0.066794
C  -1.720592 1.374344 0.056186
C  1.725418 0.125562 -0.088798
C  -2.693832 -0.997068 -0.013302
C  1.223049 2.663157 0.024891
C  -1.202566 -3.003024 -0.135879
C  -4.180199 0.956695 0.108543
C  3.191686 0.217444 -0.123947
C  3.926789 -1.141539 -0.193413
H  1.8035 2.929754 -0.871911
H  0.29105 3.245104 0.073404
H  1.852632 2.860232 0.90641
H  -2.19975 -3.465554 -0.123786
H  -0.613161 -3.347597 0.729976
H  -0.668451 -3.275733 -1.061219
H  -4.114215 2.053364 0.142382
H  -4.690238 0.571699 1.006189
H  -4.745765 0.62927 -0.778468
H  3.268536 -2.037509 -0.207921
