program: Gaussian 09
title: 000191831
version: EM64L-G09RevD.01
frameworkgroup: C1[X(C9H14N4O4)]
method: RPBEPBE
basis: SDD
operation: Freq
keyword: #p
keyword: freq=noraman
keyword: PBEPBE/SDD
title: #p freq=noraman PBEPBE/SDD
converged: YES YES NO NO
title: Mulliken charges:
elementType: O O O O N N N N C C C C C C C C C H H H H H H H H H H H H H H
charge: -0.293169 -0.452164 -0.490238 -0.269512 -0.195844 -0.603955 -0.052200 -0.625756 -0.248567 -0.157516 -0.006398 -0.017922 -0.359685 -0.085143 0.036528 -0.373291 0.184916 0.294790 0.252496 0.279434 0.252453 0.204692 0.223202 0.280056 0.336530 0.344381 0.297818 0.365081 0.227208 0.337500 0.314274
chargesum: 0.00000
title: Mulliken charges with hydrogens summed into heavy atoms:
elementType: O O O O N N N N C C C C C C C C C
charge: -0.293169 -0.107783 -0.125157 -0.269512 -0.195844 0.012631 -0.052200 0.026019 0.046223 0.094980 0.273036 0.234531 0.068209 0.212675 0.036528 -0.146083 0.184916
polarizability: 1.93597873e+02 1.45468403e+01 1.45383067e+02 -5.74060203e+00 7.26337026e-01 8.88738406e+01
1716.lowfreq: -7.8517 0.0010 0.0010 0.0011 6.1038 14.3526 31.4078 34.7694 55.2694
frequency: 31.3070 34.6941 55.1720 93.8559 122.5942 131.7218 179.3170 202.2104 202.5618 215.9486 249.7756 275.1768 302.8070 324.2000 334.9109 348.7401 360.0307 393.5873 416.8876 418.7385 454.7623 475.1959 543.2519 558.7551 576.4169 579.3762 616.2296 622.4738 692.8923 698.0697 733.2345 739.9853 767.7528 773.0903 801.6843 838.9126 866.3737 888.8219 924.0435 945.2362 950.2010 965.5977 975.1258 1015.3660 1035.6185 1061.1328 1073.3981 1090.5114 1111.5261 1161.9225 1180.0610 1188.2514 1196.0473 1210.5715 1213.4181 1230.9712 1260.3295 1274.8222 1296.9098 1302.1043 1323.8567 1330.4440 1362.6904 1384.1863 1398.0116 1405.2211 1463.9059 1471.6957 1505.5085 1587.2398 1626.0468 1637.8542 1642.3218 2963.4816 3008.4145 3023.4176 3028.3088 3038.6828 3050.3304 3169.7396 3191.4134 3423.3654 3543.0600 3572.4285 3595.4274 3600.7176 3701.7970
redmass: 6.1399 5.7566 5.3271 4.6098 4.6342 5.2869 5.7769 4.6498 2.1618 1.8391 4.1807 3.7204 4.3493 3.3905 3.8519 2.8182 1.3747 1.2118 1.3865 2.0148 3.9044 4.3331 5.0615 1.2528 5.4441 5.5114 1.6247 2.8454 2.9975 6.1277 7.2594 5.2252 1.9654 5.0929 4.6122 4.2415 2.8692 3.5467 3.3708 2.8690 1.4801 2.6574 3.9320 2.1510 4.1803 2.5756 2.0066 1.7735 1.6972 1.4173 2.2450 1.1389 1.4385 2.8203 1.2147 1.3018 1.3640 1.6203 1.4650 1.4003 1.3679 1.5665 1.5530 1.9117 1.6325 1.3833 1.0759 4.7849 4.5621 2.4721 1.9475 3.0449 1.3991 1.0572 1.0844 1.0956 1.0971 1.0856 1.0875 1.0890 1.1000 1.0507 1.0451 1.0661 1.0670 1.0948 1.1045
irintensity: 7.1727 0.9298 1.7980 2.1270 3.0031 1.7054 13.3469 9.0341 65.9516 64.0546 10.8438 4.8832 2.0185 5.8777 18.3156 32.6289 120.9162 83.3546 55.4227 151.6734 1.4382 23.2416 2.7447 104.0056 29.8387 3.6214 269.3332 70.2374 1.0778 49.7649 6.5695 4.5496 72.2403 13.5321 9.2364 31.1462 30.6159 9.9437 10.4175 67.6289 1.1084 54.0194 25.5532 31.6914 28.0070 65.5762 76.5805 55.4912 5.8519 18.8035 23.8898 75.7101 6.9665 7.9854 3.2395 20.0572 59.2861 23.8683 27.1273 5.5443 4.1082 15.5933 24.4324 44.8201 3.3838 2.4187 7.9596 158.7964 143.1132 129.3932 298.5935 402.6007 320.7168 51.3288 46.5204 12.4578 54.6165 5.4364 21.0125 1.7510 5.6904 82.4759 107.9918 10.4580 9.9950 24.1723 35.8364
temp: 298.150 k
press: 1.00000 atm
elementType: 8 8 8 8 7 7 7 7 6 6 6 6 6 6 6 6 6 1 1 1 1 1 1 1 1 1 1 1 1 1 1
symmnumber: 1
zpe: 637814.4 jmol-1
zpe.correction: 0.242931 hartree
zpe.thermalcorrener: 0.259458 hartree
zpe.thermalcorrenthalpy: 0.260402 hartree
zpe.thermalcorrgfe: 0.198720 hartree
zpe.sumelectzpe: -869.941001 hartree
zpe.sumelectthermal: -869.924474 hartree
zpe.sumelectthermalent: -869.923530 hartree
zpe.sumelectthermalfe: -869.985211 hartree
dipole: 2.0088 -7.6567 1.2723
dipole: 8.0174
quadrupole: -74.3552 -94.1401 -104.7589
quadrupole: 10.5510 -0.9207 2.7715
quadrupole: 16.7295 -3.0554 -13.6742 10.5510 -0.9207 2.7715
hfenergy: -870.1839314 hartree
pointgroup: C01 [X(C9H14N4O4)]
dipole: 0.832068 2.8671122 -1.0183111 debye
polarizability: 192.2450516|-11.9692829|143.2999263|15.3761562|-10.7612552|92.309803 unknown
InChI: InChI=1S/C9H14N4O4/c10-5-1-2-13(9(16)12-5)8-6(11)7(15)4(3-14)17-8/h1-2,4,6-8,14-15H,3,10-11H2
charge 0 multiplicity 1
31 atoms
O  1.240235 0.593661 1.06834
O  3.307523 -1.876224 0.622698
O  2.686535 2.102479 -1.000511
O  -1.474103 -2.396807 0.323416
N  -0.835475 -0.146195 0.170535
N  1.195904 -0.230798 -1.971455
N  -3.143891 -0.810155 -0.17239
N  -4.741279 0.770377 -0.748228
C  1.39487 -0.997638 -0.750445
C  2.829235 -0.756078 -0.202677
C  0.531895 -0.563307 0.499569
C  2.688827 0.433659 0.78566
C  3.252094 1.772766 0.321146
C  -1.125735 1.151645 -0.182928
C  -1.849001 -1.205463 0.114822
C  -2.41767 1.517125 -0.521337
C  -3.422059 0.478549 -0.4755
H  1.207015 -2.067202 -0.948616
H  3.518854 -0.544362 -1.040874
H  0.467741 -1.39329 1.22551
H  3.201086 0.144912 1.724535
H  4.358057 1.6922 0.265376
H  2.978846 2.549037 1.063584
H  0.310738 -0.385189 -2.456216
H  1.511456 0.745992 -1.922028
H  3.349487 -2.694259 0.066289
H  -0.289637 1.853086 -0.137246
H  3.01105 2.987747 -1.295365
H  -2.655135 2.549573 -0.78488
H  -5.414545 0.007536 -0.697618
H  -5.04852 1.711622 -0.975366
