program: Gaussian 09
title: 000191815
version: EM64L-G09RevD.01
frameworkgroup: C1[X(C9H5NO4S)]
method: RPBEPBE
basis: SDD
operation: Freq
keyword: #p
keyword: freq=noraman
keyword: PBEPBE/SDD
title: #p freq=noraman PBEPBE/SDD
converged: YES YES NO NO
title: Mulliken charges:
elementType: S O O O O N C C C C C C C C C H H H H H
charge: 0.171371 -0.405379 -0.435056 -0.221645 -0.230116 0.315095 0.289718 0.162131 -0.535911 -0.290612 0.524791 -0.389632 0.086515 0.118793 -0.781240 0.290189 0.284838 0.266734 0.389511 0.389905
chargesum: 0.00000
title: Mulliken charges with hydrogens summed into heavy atoms:
elementType: S O O O O N C C C C C C C C C
charge: 0.171371 -0.015869 -0.045151 -0.221645 -0.230116 0.315095 0.289718 0.162131 -0.245722 -0.005774 0.524791 -0.122898 0.086515 0.118793 -0.781240
polarizability: 2.93180997e+02 -1.17923573e+01 1.25846147e+02 1.62000957e-01 -6.37588337e+00 5.89868444e+01
1716.lowfreq: -4.9188 -2.4372 0.0015 0.0019 0.0022 4.8877 22.0499 30.4655 45.6108
frequency: 22.0267 30.4550 45.6090 91.5214 110.3049 145.0075 169.7074 194.8923 267.9722 289.9662 320.6994 354.8502 380.6847 419.3139 431.5365 442.2715 477.2861 527.9720 575.9395 588.1254 597.2757 618.0910 637.0545 682.7627 713.8004 731.9293 784.7251 796.8562 859.0369 921.2576 950.3507 988.1847 1003.2909 1040.3748 1101.3333 1162.2987 1167.1802 1254.8977 1284.7139 1316.4423 1320.7286 1367.1692 1419.3499 1487.8845 1556.4095 1608.5339 1643.6875 1648.3536 2189.6408 3165.7987 3171.1047 3187.2616 3524.7840 3529.9477
redmass: 12.4728 13.1603 9.5008 10.6932 5.2453 8.2455 7.1181 8.2313 13.3600 7.3507 6.6837 7.1498 8.5758 5.9588 8.4714 5.2976 5.1460 2.6383 2.1564 1.2554 4.6927 3.2422 5.5072 3.4059 5.7320 7.3823 3.9888 8.4199 1.5107 1.5784 6.2002 1.4168 4.9779 3.0005 2.0059 1.3547 1.7453 1.7966 2.0375 2.4184 3.0182 8.4778 5.0127 3.1985 8.3374 6.5931 9.0878 9.7707 12.8905 1.0899 1.0932 1.0969 1.0641 1.0643
irintensity: 0.0928 0.6208 0.0338 1.0576 0.6914 2.2306 2.3249 0.8438 0.9522 4.4982 0.2436 1.5133 4.6416 6.5667 6.8532 7.8780 24.2426 50.4257 82.8350 148.8742 41.4810 10.1943 3.0633 28.5143 47.6928 31.9936 10.6305 48.2578 33.2563 35.0450 37.8788 19.3444 221.9443 333.7681 70.7920 67.8075 85.2867 0.6840 7.9841 24.6045 164.9516 65.5210 16.1510 17.4136 68.3275 183.0126 402.2529 149.7101 1677.6068 1.6966 1.3307 1.4572 44.8462 64.4824
temp: 298.150 k
press: 1.00000 atm
elementType: 16 8 8 8 8 7 6 6 6 6 6 6 6 6 6 1 1 1 1 1
symmnumber: 1
zpe: 330879.0 jmol-1
zpe.correction: 0.126025 hartree
zpe.thermalcorrener: 0.139720 hartree
zpe.thermalcorrenthalpy: 0.140664 hartree
zpe.thermalcorrgfe: 0.082839 hartree
zpe.sumelectzpe: -1098.633543 hartree
zpe.sumelectthermal: -1098.619848 hartree
zpe.sumelectthermalent: -1098.618904 hartree
zpe.sumelectthermalfe: -1098.676729 hartree
dipole: 1.5788 -2.8195 1.4892
dipole: 3.5581
quadrupole: -95.5614 -86.0964 -96.2812
quadrupole: -3.2685 4.6022 6.9512
quadrupole: -2.9150 6.5499 -3.6349 -3.2685 4.6022 6.9512
hfenergy: -1098.7595681 hartree
pointgroup: C01 [X(C9H5N1O4S1)]
dipole: -0.5096537 1.1364842 0.6389644 debye
dipolederiv: -1.4245314 0.2264144 0.1027463 0.2848721 -0.0829203 -0.0210501 0.111162 -0.017432 -0.0472167 -0.7075286 0.021698 0.4328335 -0.0925067 -0.3616204 0.1213031 0.5097092 0.160368 -0.9038963 -0.5865022 0.3711347 0.1490398 0.5901835 -1.141203 -0.2570475 0.2409664 -0.2511029 -0.4968396 -0.4831804 -0.1463245 0.0972441 -0.1923251 -0.8722787 -0.320843 0.1515435 -0.0987652 -0.6286656 -1.1838088 -0.1114811 -0.1618504 -0.1305283 -0.661752 -0.1509641 -0.1362787 -0.1695128 -0.3946451 -3.0069036 0.4775639 0.2242456 0.6134358 -0.2472535 -0.047591 0.2364132 -0.0460066 -0.0413004 0.1355969 -0.1786471 0.0343571 -0.3785382 -0.0788548 0.0052069 -0.1188054 -0.0322227 -0.011378 -0.974629 0.2023703 0.0386093 0.2361616 -0.0474701 -0.0577648 0.0807211 0.0303347 -0.0149196 -0.5706677 0.0582061 0.0221626 -0.2724523 -0.0168842 0.0201593 -0.0227868 -0.0134748 -0.133264 0.2374934 -0.1605164 -0.025453 0.0413904 0.0231265 0.0064855 0.0518355 0.0223586 -0.0875434 1.9198971 -0.2523491 -0.1377354 -0.2224336 0.2874021 0.0201407 -0.1255854 0.0332672 0.133177 -0.378726 0.1859311 0.0193195 0.3387078 -0.0871439 -0.0106439 0.0397163 -0.0092583 -0.1580135 1.0108852 0.3670604 -0.5735615 0.5490576 1.2191051 0.2662749 -0.573341 0.0595203 1.155905 2.1806156 -0.3569414 0.0696328 -0.4847965 1.3744808 0.4737531 0.0045195 0.4149245 0.4523306 3.1448184 -0.5624541 -0.2434302 -0.7025555 0.0830219 0.0545203 -0.2641137 0.045996 -0.0373375 0.089465 0.0275613 0.0020827 0.0534977 0.023849 -0.0048134 0.034985 -0.0003836 0.1616932 0.0982486 0.0296739 0.0025062 0.0309038 0.0116078 -0.0011352 -0.0229112 -0.0082616 0.1566302 0.0205983 -0.0705509 0.0024064 -0.0757044 0.0296945 0.0004748 0.0006609 0.0028468 0.1690695 0.3019549 -0.0824946 0.0044482 -0.0638463 0.1866216 -0.0710743 -0.0765579 -0.1221734 0.3488139 0.1769044 -0.0458549 -0.0596036 -0.1225235 0.3584716 -0.0253916 -0.1218523 -0.001022 0.3774004 unknown
polarizability: 289.9620217|-20.8091417|127.6152396|-17.2594548|8.7530916|60.4367264 unknown
InChI: InChI=1S/C9H5NO4S/c11-8(12)6-2-1-5(10-4-15)3-7(6)9(13)14/h1-3,11,13H
charge 0 multiplicity 1
20 atoms
S  5.830134 -0.56368 -0.454732
O  -2.297961 -1.734366 1.234882
O  -2.845418 2.321159 0.455333
O  -1.380073 -2.808075 -0.613701
O  -3.41412 0.265187 -0.463499
N  3.06761 0.025829 -0.230471
C  -0.580707 -0.585721 0.019666
C  -1.074407 0.751241 0.068572
C  0.802351 -0.823522 -0.097439
C  -0.150243 1.827614 0.059089
C  1.7178 0.264149 -0.122425
C  1.232224 1.597888 -0.026871
C  -1.456875 -1.802833 0.125176
C  -2.536096 1.03195 -0.006196
C  4.244312 -0.231884 -0.326386
H  1.173503 -1.850498 -0.159358
H  -0.536242 2.848926 0.103643
H  1.941276 2.43053 -0.036735
H  -2.900118 -2.526783 1.245264
H  -3.82255 2.473788 0.347992
