program: Gaussian 09
title: 000191812
version: EM64L-G09RevD.01
frameworkgroup: C1[X(C11H11N3O4)]
method: RPBEPBE
basis: SDD
operation: Freq
keyword: #p
keyword: freq=noraman
keyword: PBEPBE/SDD
title: #p freq=noraman PBEPBE/SDD
converged: YES YES NO NO
title: Mulliken charges:
elementType: O O O O N N N C C C C C C C C C C C H H H H H H H H H H H
charge: -0.232301 -0.236229 -0.212970 -0.207370 -0.378178 -0.444536 0.022131 -0.191434 -0.450559 -0.513444 0.156206 0.175336 0.520639 -0.427697 -0.311831 -0.343410 -0.362053 0.393756 0.262716 0.215015 0.245619 0.248538 0.259385 0.355702 0.325676 0.233069 0.318114 0.290054 0.290056
chargesum: 0.00000
title: Mulliken charges with hydrogens summed into heavy atoms:
elementType: O O O O N N N C C C C C C C C C C C
charge: -0.232301 -0.236229 -0.212970 -0.207370 -0.022476 -0.118861 0.022131 0.071282 0.010075 -0.005520 0.156206 0.175336 0.520639 -0.194628 0.006283 -0.053356 -0.071998 0.393756
polarizability: 2.80742970e+02 -3.92191172e+00 1.50488461e+02 1.91236016e+00 3.94134709e+00 7.62144541e+01
1716.lowfreq: -2.1182 0.0006 0.0007 0.0009 4.4118 8.5754 26.6521 31.7783 59.4000
frequency: 26.6339 31.7114 59.3866 62.2895 79.9426 100.9212 138.6983 154.4456 165.3804 207.5675 255.8062 301.8462 335.6756 364.6023 407.2437 416.2996 453.5014 498.8067 508.2020 508.8814 551.3627 596.9767 616.6914 627.2865 646.9334 662.1439 667.4685 692.9152 738.6548 753.7593 785.9731 818.7634 837.6893 840.7223 872.7608 881.5134 905.6461 976.9689 980.1603 999.9832 1007.4176 1012.2255 1042.8974 1095.9858 1115.2760 1119.1418 1143.2250 1175.7219 1182.4911 1200.8810 1223.7549 1248.4809 1263.5010 1270.7455 1290.6277 1294.1038 1302.0429 1325.9992 1357.8957 1380.1015 1394.4207 1425.9490 1454.2241 1474.9330 1486.0216 1513.4381 1599.9089 1612.8269 1631.0383 1676.4165 2912.5221 3008.7333 3019.1392 3073.2983 3103.4953 3127.2603 3180.2955 3186.8516 3204.9267 3508.5695 3566.4133
redmass: 8.1020 4.9408 8.7001 8.2229 5.8826 5.4020 6.8355 2.6209 4.6843 8.8318 6.7709 5.5986 7.1532 5.3848 8.7502 3.0160 4.4317 2.4711 2.1851 5.9484 4.1800 2.1109 7.9521 6.5805 2.4254 1.2429 4.6002 4.0393 4.6305 6.8176 7.7878 2.5194 1.3834 4.4533 3.0874 1.5043 2.5646 3.2982 1.3470 3.1257 2.2559 1.3221 2.0814 3.0250 1.8406 1.2969 1.9498 1.9822 1.6103 1.3703 4.5213 2.2756 2.0356 1.3532 1.4435 1.2989 1.4622 1.6790 6.7323 2.1328 5.7822 4.8656 1.0839 1.0980 2.4497 2.3488 7.2916 5.3771 5.7777 9.1714 1.0819 1.0588 1.0667 1.1044 1.0998 1.0910 1.0909 1.0946 1.0959 1.0762 1.0786
irintensity: 2.7049 0.4855 2.2336 4.4125 0.9363 1.9102 1.0653 0.3515 1.3881 0.8838 13.5480 5.4107 4.1008 2.6347 18.8381 0.2094 12.1247 4.3186 39.2367 1.0692 5.4039 67.0609 1.7243 3.5274 53.0065 76.8406 25.4067 28.0940 7.3423 18.4223 3.6949 4.3940 27.8956 11.6541 2.7275 70.9213 2.4678 5.2851 0.9523 0.6238 6.0077 0.2942 5.8350 23.5713 8.5887 27.4242 67.8289 384.8502 5.3823 7.2939 405.7395 94.9335 56.6109 1.0418 18.3414 19.0152 23.2338 17.1378 101.3508 113.4144 176.5986 39.3955 8.2080 6.8839 11.2612 511.7089 101.1417 167.7947 107.4585 491.1723 44.8373 30.9277 11.8511 19.8545 12.8139 12.2236 2.2871 3.1346 4.8030 18.8799 57.3476
temp: 298.150 k
press: 1.00000 atm
elementType: 8 8 8 8 7 7 7 6 6 6 6 6 6 6 6 6 6 6 1 1 1 1 1 1 1 1 1 1 1
symmnumber: 1
zpe: 566703.4 jmol-1
zpe.correction: 0.215846 hartree
zpe.thermalcorrener: 0.231505 hartree
zpe.thermalcorrenthalpy: 0.232449 hartree
zpe.thermalcorrgfe: 0.170524 hartree
zpe.sumelectzpe: -889.569137 hartree
zpe.sumelectthermal: -889.553479 hartree
zpe.sumelectthermalent: -889.552534 hartree
zpe.sumelectthermalfe: -889.614459 hartree
dipole: 2.3057 5.6247 2.0109
dipole: 6.4029
quadrupole: -175.8131 -98.6378 -103.3498
quadrupole: 14.3409 5.1917 -0.6629
quadrupole: -49.8795 27.2958 22.5838 14.3409 5.1917 -0.6629
hfenergy: -889.784983 hartree
pointgroup: C01 [X(C11H11N3O4)]
dipole: -0.9155808 -2.345752 0.0712168 debye
polarizability: 280.6599917|-4.1478017|146.3075974|4.733216|17.4537291|80.4782964 unknown
InChI: InChI=1S/C11H11N3O4/c15-10-6-5-9(13-10)11(16)12-7-1-3-8(4-2-7)14(17)18/h1-4,9,12-13H,5-6H2
charge 0 multiplicity 1
29 atoms
O  -6.13225 1.016453 -0.513632
O  -1.388076 1.517034 0.693499
O  5.866688 -0.894218 -0.200062
O  5.616623 1.317325 0.309391
N  -3.995746 0.651381 0.425637
N  -0.512192 -0.608407 0.189315
N  5.139312 0.14091 0.068962
C  -2.947197 -0.366414 0.469776
C  -3.298903 -1.284696 -0.752028
C  -4.826847 -1.091094 -0.925127
C  -5.105012 0.312319 -0.342869
C  -1.550512 0.289119 0.448695
C  0.885354 -0.365708 0.169323
C  1.73476 -1.471607 -0.121466
C  1.451071 0.915381 0.425472
C  3.127417 -1.31239 -0.155907
C  2.847362 1.074838 0.391832
C  3.671882 -0.034334 0.103272
H  -3.00741 -0.95966 1.411274
H  -3.019054 -2.338794 -0.578964
H  -2.770597 -0.922485 -1.652488
H  -5.411747 -1.834871 -0.352693
H  -5.163138 -1.13588 -1.972593
H  -3.879027 1.561231 0.875739
H  -0.794266 -1.57032 -0.020976
H  1.300064 -2.459022 -0.319869
H  0.794747 1.759013 0.642388
H  3.796639 -2.14755 -0.376644
H  3.307753 2.047348 0.584846
