program: Gaussian 09
title: 000017783
version: EM64L-G09RevD.01
frameworkgroup: C1[X(C11H16O)]
method: RPBEPBE
basis: SDD
operation: Freq
keyword: #pfreq=noraman
keyword: PBEPBE/SDD
title: #p freq=noraman PBEPBE/SDD
converged: YES YES NO NO
title: Mulliken charges:
elementType: O C C C C C C C C C C C H H H H H H H H H H H H H H H H
charge: -0.444308 0.157002 0.221855 0.215536 0.172689 0.141013 -0.052303 -0.881058 -0.879700 -0.878330 -0.906165 -0.853765 0.230970 0.253379 0.230611 0.231335 0.231607 0.255474 0.255985 0.231752 0.231644 0.233612 0.234457 0.271284 0.223116 0.282379 0.222570 0.367357
chargesum: 0.00000
title: Mulliken charges with hydrogens summed into heavy atoms:
elementType: O C C C C C C C C C C C
charge: -0.076951 0.157002 0.221855 0.215536 0.172689 0.141013 -0.052303 -0.166098 -0.161284 -0.158948 -0.166812 -0.125700
polarizability: 1.51337051e+02 1.28920467e+00 1.46418757e+02 2.21587537e-02 6.37924164e-03 7.31881049e+01
1716.lowfreq: -16.4007 -13.5542 -6.2308 0.0004 0.0006 0.0007 44.9300 73.3553 99.0211
frequency: 44.6499 73.2919 99.0082 130.7689 159.3096 165.3375 177.8202 188.4879 224.6232 247.2936 306.5786 331.0719 349.4069 352.1661 356.0633 371.9286 391.2213 445.2105 449.9076 540.6963 576.2888 585.2852 593.1008 615.9951 753.2971 798.6199 813.4588 968.6578 982.1608 1007.0450 1017.1321 1021.6658 1034.7549 1047.3976 1053.1031 1065.0778 1076.2489 1084.4675 1091.0816 1203.0532 1253.7313 1337.6224 1365.3022 1388.3082 1389.7365 1393.6526 1397.3628 1403.7424 1416.9013 1441.1896 1458.4228 1464.9762 1465.3722 1476.3052 1484.2639 1488.6002 1501.0128 1501.5698 1503.1065 1510.8143 1589.4695 1617.7114 2942.6522 2971.6103 2972.4319 2975.1333 2975.5417 3004.4093 3038.4033 3039.4081 3044.5445 3045.6983 3104.2636 3108.1318 3109.3170 3113.9651 3114.6805 3589.7032
redmass: 1.1905 1.5190 1.8743 1.6528 1.5842 1.3261 1.5517 1.1377 1.4624 1.1924 2.6906 2.8065 3.7709 2.9761 2.6753 4.1582 2.6998 4.8351 5.6493 4.6619 3.4549 4.2828 2.6207 4.4680 3.6000 2.5077 2.6832 1.5719 1.5346 1.3528 1.6140 1.4073 1.4904 1.5713 1.7216 2.0173 2.3287 3.3517 2.1343 1.4782 5.0066 9.6080 5.0153 1.2379 1.2767 1.2910 1.1916 1.1658 4.0278 2.6303 1.1233 1.0706 1.0721 1.0467 1.1900 1.0462 1.1292 1.1362 1.1302 1.0468 6.2256 6.7371 1.0427 1.0410 1.0414 1.0398 1.0406 1.0977 1.0972 1.0974 1.0973 1.0975 1.0943 1.0918 1.0927 1.0923 1.0949 1.0650
irintensity: 0.0387 0.2613 0.2121 0.3644 0.2778 0.6224 3.2341 0.8700 3.8610 114.6524 2.2083 3.5710 7.8143 7.9211 0.1619 0.0619 0.3032 0.1299 1.3484 2.0582 0.0513 1.7641 6.0046 0.3932 0.4936 1.7758 22.5770 1.2776 4.9329 11.6887 19.7965 0.0709 0.7743 0.0096 0.0372 107.2883 18.7456 35.8932 1.2777 110.3964 7.9999 10.8096 4.8288 1.9266 0.4155 24.8014 25.9734 5.2963 28.5400 1.4208 1.6205 24.0648 22.8369 0.1157 32.0159 6.6424 19.5898 21.8486 16.7476 0.6206 14.7958 4.4883 47.4869 31.7245 56.5287 18.2937 44.5689 24.2666 38.4252 7.2901 28.6291 17.4950 25.4414 30.7170 12.3901 7.5556 2.9757 26.0114
temp: 298.150 k
press: 1.00000 atm
elementType: 8 6 6 6 6 6 6 6 6 6 6 6 1 1 1 1 1 1 1 1 1 1 1 1 1 1 1 1
symmnumber: 1
zpe: 626794.2 jmol-1
zpe.correction: 0.238733 hartree
zpe.thermalcorrener: 0.252747 hartree
zpe.thermalcorrenthalpy: 0.253692 hartree
zpe.thermalcorrgfe: 0.199043 hartree
zpe.sumelectzpe: -503.083347 hartree
zpe.sumelectthermal: -503.069333 hartree
zpe.sumelectthermalent: -503.068389 hartree
zpe.sumelectthermalfe: -503.123038 hartree
dipole: -1.5665 0.8788 -0.0130
dipole: 1.7962
quadrupole: -64.2401 -71.4779 -76.0813
quadrupole: 4.6091 0.0238 0.0557
quadrupole: 6.3596 -0.8781 -5.4815 4.6091 0.0238 0.0557
hfenergy: -503.3220807 hartree
pointgroup: C01 [X(C11H16O1)]
dipole: 0.6628103 0.2447952 0.0128737 debye
polarizability: 150.8153433|-1.9936656|146.9169391|0.40513|1.2458052|73.211631 unknown
InChI: InChI=1S/C11H16O/c1-6-7(2)9(4)11(12)10(5)8(6)3/h12H,1-5H3
charge 0 multiplicity 1
28 atoms
O  -0.053031 -2.801068 -0.066248
C  -0.000695 1.431023 0.006782
C  1.237133 0.719944 -0.000605
C  -1.238269 0.714744 -0.014955
C  1.23934 -0.70291 -0.025406
C  -1.249847 -0.709141 -0.038366
C  -0.005054 -1.383839 -0.042133
C  0.001866 2.956866 0.039075
C  2.567086 1.466015 0.015296
C  -2.562587 1.47029 -0.014635
C  2.519959 -1.526359 -0.033594
C  -2.534968 -1.521793 -0.057824
H  0.503292 3.385001 -0.85047
H  -1.016818 3.370634 0.066376
H  0.533932 3.345699 0.928413
H  3.171989 1.200254 0.903771
H  3.178152 1.225347 -0.876022
H  2.431465 2.557145 0.029467
H  -3.422967 0.786364 -0.057751
H  -2.678898 2.088404 0.896243
H  -2.640996 2.153121 -0.881877
H  2.59176 -2.190796 0.853197
H  2.597912 -2.163531 -0.939541
H  3.417352 -0.891093 -0.020177
H  -3.140131 -1.30634 -0.959171
H  -2.305445 -2.597393 -0.053815
H  -3.168508 -1.303899 0.822747
H  0.861777 -3.175489 -0.057777
