program: Gaussian 09
title: 000191807
version: EM64L-G09RevD.01
frameworkgroup: C1[X(C9H11N3O6)]
method: RPBEPBE
basis: SDD
operation: Freq
keyword: #p
keyword: freq=noraman
keyword: PBEPBE/SDD
title: #p freq=noraman PBEPBE/SDD
converged: YES YES NO NO
title: Mulliken charges:
elementType: O O O O O O N N N C C C C C C C C C H H H H H H H H H H H
charge: -0.219729 -0.217090 -0.439055 -0.428168 -0.229170 -0.202565 -0.274583 -0.255438 0.033778 -0.186062 -0.071251 -0.130288 -0.096581 0.194785 -0.383152 0.329168 0.061824 -0.588606 0.290344 0.297752 0.286513 0.272313 0.233638 0.242827 0.354406 0.346839 0.273221 0.253532 0.250800
chargesum: 0.00000
title: Mulliken charges with hydrogens summed into heavy atoms:
elementType: O O O O O O N N N C C C C C C C C C
charge: -0.219729 -0.217090 -0.084649 -0.081330 -0.229170 -0.202565 -0.274583 -0.255438 0.033778 0.104282 0.226500 0.156225 0.175732 0.194785 0.093313 0.329168 0.061824 0.188947
polarizability: 1.77205174e+02 -1.25385116e+01 1.24556991e+02 -1.04540968e+01 -7.70966848e+00 1.00366615e+02
1716.lowfreq: -0.0005 -0.0004 -0.0002 2.5574 8.5228 12.4469 31.9588 47.7334 67.0355
frequency: 31.8602 47.6626 67.0209 79.3405 83.6435 103.4706 137.7773 163.4782 195.1713 206.9533 244.7612 275.2197 283.4324 293.1603 308.2966 326.0190 346.3763 393.6417 400.4116 433.5935 464.6855 502.4037 522.6416 585.8134 626.2263 662.1543 683.0402 708.0248 725.7600 738.8926 744.0399 821.9351 824.1177 852.3546 882.0516 913.6051 939.3476 958.7899 978.1401 985.6566 1007.2213 1031.4599 1033.1859 1047.8461 1072.6611 1110.9118 1130.4919 1145.0573 1181.3007 1194.1856 1213.4282 1222.5780 1222.6430 1254.1662 1278.7794 1295.2273 1296.4270 1309.6088 1320.1216 1340.3370 1369.7495 1374.6619 1394.1531 1427.5838 1473.0848 1475.2007 1477.2766 1618.9846 1624.6798 1679.1423 3002.0197 3013.0628 3039.4313 3055.7132 3091.0391 3093.4558 3105.0831 3106.1874 3146.0796 3568.0447 3568.9309
redmass: 6.2396 6.8847 1.0646 5.6178 5.3466 4.0455 7.2376 5.8291 6.5039 4.6797 2.7575 3.6444 3.1578 3.2977 1.2120 3.3930 2.4112 8.5880 8.0234 7.0029 5.4726 6.4412 7.7708 8.4832 11.4553 11.7372 7.1774 9.7515 6.2446 7.8562 10.5434 3.9023 4.5774 2.5931 3.5393 3.8554 5.5143 3.6737 4.9708 3.4304 4.3129 3.9540 4.4944 1.8501 1.6361 7.0191 1.3067 1.2263 1.9066 1.5487 8.5924 1.8279 1.9593 1.3790 1.2525 1.5021 1.6245 2.0659 1.6526 1.2841 2.3171 1.2362 1.5601 1.2121 1.0855 1.0590 1.0459 11.8735 12.4734 11.0710 1.0638 1.0335 1.0864 1.0880 1.0898 1.1003 1.1024 1.0898 1.1016 1.0666 1.0668
irintensity: 0.6669 0.2234 0.3682 0.7230 0.5326 12.5426 2.9522 2.2383 4.7477 7.6308 50.6908 37.3519 119.7056 24.7445 84.4975 5.5746 26.6273 11.0547 3.7151 1.4908 36.2562 6.2579 19.3941 2.6966 6.6551 0.5622 3.7111 1.1060 3.3219 26.8982 37.5072 35.8405 4.6908 35.3083 24.8228 59.1872 126.9293 79.7128 124.1755 18.0104 75.7060 76.7358 22.5592 21.7749 10.1847 110.4418 0.1339 18.4435 83.3790 49.1627 73.7601 10.4925 10.4024 4.7840 23.6121 44.3484 16.7032 59.0908 64.5880 14.2890 206.0021 6.2699 3.0697 106.4625 2.8218 13.9046 18.1705 439.9759 1065.7680 110.9883 31.0504 22.2149 5.1179 11.0294 6.0642 25.5899 13.6072 12.6542 0.5472 14.8252 15.3174
temp: 298.150 k
press: 1.00000 atm
elementType: 8 8 8 8 8 8 7 7 7 6 6 6 6 6 6 6 6 6 1 1 1 1 1 1 1 1 1 1 1
symmnumber: 1
zpe: 555977.5 jmol-1
zpe.correction: 0.211761 hartree
zpe.thermalcorrener: 0.228241 hartree
zpe.thermalcorrenthalpy: 0.229185 hartree
zpe.thermalcorrgfe: 0.166907 hartree
zpe.sumelectzpe: -963.787964 hartree
zpe.sumelectthermal: -963.771484 hartree
zpe.sumelectthermalent: -963.770540 hartree
zpe.sumelectthermalfe: -963.832818 hartree
dipole: 4.8864 -2.7750 -0.7381
dipole: 5.6677
quadrupole: -96.6108 -129.2893 -93.3719
quadrupole: 10.7697 -5.9594 10.8277
quadrupole: 9.8132 -22.8653 13.0521 10.7697 -5.9594 10.8277
hfenergy: -963.9997247 hartree
pointgroup: C01 [X(C9H11N3O6)]
dipole: 1.9758959 -0.4062644 -0.9502652 debye
polarizability: 179.0130187|-0.8920682|114.4056124|-11.338957|14.671758|108.7101484 unknown
InChI: InChI=1S/C9H11N3O6/c1-11-7(15)10-8-12(9(11)16)6-5(18-8)4(14)3(2-13)17-6/h3-6,13-14H,2H2,1H3
charge 0 multiplicity 1
29 atoms
O  1.488362 -1.479329 -0.484619
O  0.761564 1.738833 -0.016935
O  4.01447 0.252561 -1.082522
O  3.095512 -0.435219 2.781901
O  -1.738392 -1.798381 -1.621209
O  -3.752216 1.338158 1.258152
N  -0.490101 -0.037992 -0.69562
N  -2.779192 -0.230318 -0.197016
N  -1.499872 1.665759 0.683716
C  1.642945 0.911793 -0.912966
C  0.840596 -0.396099 -1.21519
C  2.907928 0.457525 -0.14368
C  2.53121 -0.921777 0.429284
C  -0.493923 1.1473 0.038513
C  2.017508 -0.870574 1.884581
C  -1.687331 -0.778343 -0.894545
C  -2.731398 0.96544 0.639314
C  -4.068271 -0.947586 -0.331441
H  1.87043 1.521937 -1.79963
H  0.772831 -0.704283 -2.268344
H  3.164792 1.174825 0.657659
H  3.396046 -1.602656 0.346385
H  1.613177 -1.863526 2.161888
H  1.224131 -0.116268 2.013571
H  4.451432 1.118217 -1.284021
H  3.75601 -1.166106 2.884711
H  -4.797797 -0.433066 0.309431
H  -3.949885 -1.996819 -0.015608
H  -4.403467 -0.932809 -1.38176
