program: Gaussian 09
title: 000191801
version: EM64L-G09RevD.01
frameworkgroup: C1[X(C7H15NO4)]
method: RPBEPBE
basis: SDD
operation: Freq
keyword: #p
keyword: freq=noraman
keyword: PBEPBE/SDD
title: #p freq=noraman PBEPBE/SDD
converged: NO YES NO NO
title: Mulliken charges:
elementType: O O O O N C C C C C C C H H H H H H H H H H H H H H H
charge: -0.263513 -0.442795 -0.310075 -0.457289 -0.608450 -0.088882 -0.449163 0.076689 -0.184309 -0.076028 -0.489857 -0.495714 0.214021 0.248571 0.211363 0.217728 0.263230 0.228702 0.228111 0.220417 0.352240 0.354255 0.281337 0.289032 0.212694 0.235412 0.232275
chargesum: 0.00000
title: Mulliken charges with hydrogens summed into heavy atoms:
elementType: O O O O N C C C C C C C
charge: -0.263513 -0.090555 -0.310075 -0.103033 -0.038081 0.125139 0.010771 0.294416 0.078921 0.152674 -0.041330 0.184666
polarizability: 1.06934698e+02 2.88438441e+00 9.83789299e+01 7.80338221e-01 -2.45732537e+00 7.76619228e+01
1716.lowfreq: -78.7562 -12.5997 0.0003 0.0009 0.0010 10.5351 17.4559 66.6068 81.9164
frequency: -78.7196 66.5461 81.8667 105.6171 131.8033 144.7967 166.8023 189.7582 205.6120 236.3207 300.3722 317.1609 364.7291 377.9914 396.4287 422.1216 452.9280 463.3117 492.8919 532.9314 562.0280 615.3547 697.4072 764.6971 825.7310 849.8208 894.1641 955.6862 980.2865 998.8721 1004.7029 1017.0607 1045.6445 1067.6333 1081.8466 1100.1317 1116.8541 1138.5882 1143.0919 1163.5521 1188.1056 1238.5386 1249.3702 1275.4918 1277.4457 1288.7338 1312.2214 1313.9247 1319.1608 1363.2750 1363.9372 1368.6978 1377.0167 1398.1483 1431.9144 1457.0604 1460.5729 1464.6967 1479.0910 1637.1993 2949.6115 2960.5402 2965.6701 2979.8654 3001.7048 3007.6133 3041.7235 3056.0729 3063.6750 3078.5988 3117.6838 3495.3874 3521.2255 3546.5222 3677.3679
redmass: 1.0461 3.7973 3.9082 2.3919 1.7252 2.4983 2.5235 3.0393 3.7048 4.6505 4.1298 4.9151 2.8517 2.3327 1.7471 3.4263 1.1440 3.7408 3.5288 1.1542 3.5623 4.5627 4.7397 3.3540 2.6506 1.5279 2.8077 3.2170 2.8160 3.6762 4.9899 3.1218 2.2658 3.4188 1.8014 3.0232 1.2662 1.5730 1.9949 1.8727 1.4595 1.5239 1.3264 1.4086 1.2378 1.2437 1.2356 1.1913 1.2043 1.5378 1.3475 1.3001 1.2825 1.6177 1.1417 1.0510 1.0913 1.0863 1.0522 1.0966 1.0832 1.0341 1.0625 1.0835 1.0632 1.0866 1.1005 1.1003 1.0865 1.1001 1.1017 1.0646 1.0651 1.0452 1.1015
irintensity: 14.6841 1.0012 0.1067 1.8897 1.0726 0.9737 3.5308 5.2620 7.3748 11.9271 10.3836 6.8076 29.0653 24.3798 188.3311 37.0636 49.9926 1.8372 17.2549 243.3240 10.5391 9.9501 26.6700 26.6521 28.9770 12.6504 12.9177 42.5930 112.1733 157.7933 85.6639 68.3147 59.1921 52.7166 3.9990 31.5768 1.1104 15.0023 9.9529 20.1771 3.7288 59.5228 18.1386 8.7899 29.1624 25.7051 8.8269 0.5222 16.6851 13.7314 4.0668 12.9834 17.1766 8.4656 5.8971 10.5805 9.8972 6.4427 11.6652 43.4842 35.4239 60.2422 54.1557 16.9982 24.7333 50.1676 40.4706 42.0672 18.2510 26.2997 22.0222 23.7614 10.0252 3.9637 10.3064
temp: 298.150 k
press: 1.00000 atm
elementType: 8 8 8 8 7 6 6 6 6 6 6 6 1 1 1 1 1 1 1 1 1 1 1 1 1 1 1
symmnumber: 1
zpe: 593353.8 jmol-1
zpe.correction: 0.225997 hartree
zpe.thermalcorrener: 0.239045 hartree
zpe.thermalcorrenthalpy: 0.239989 hartree
zpe.thermalcorrgfe: 0.187143 hartree
zpe.sumelectzpe: -630.357452 hartree
zpe.sumelectthermal: -630.344403 hartree
zpe.sumelectthermalent: -630.343459 hartree
zpe.sumelectthermalfe: -630.396305 hartree
dipole: -1.8565 3.5895 -0.7417
dipole: 4.1087
quadrupole: -64.4611 -74.2183 -72.2422
quadrupole: 4.0417 -1.3343 -3.6348
quadrupole: 5.8461 -3.9111 -1.9350 4.0417 -1.3343 -3.6348
hfenergy: -630.5834481 hartree
pointgroup: C01 [X(C7H15N1O4)]
dipole: -0.7589077 1.379907 -0.3645479 debye
polarizability: 106.7076269|3.2311497|98.3334942|1.5325222|-3.1148758|77.9344298 unknown
InChI: InChI=1S/C7H15NO4/c1-11-7-6(10)5(9)2-4(3-8)12-7/h4-7,9-10H,2-3,8H2,1H3
charge 0 multiplicity 1
27 atoms
O  -0.580413 0.942281 0.912321
O  0.923967 -2.881361 -0.193191
O  1.286505 1.409762 -0.572309
O  2.778606 -0.682041 0.337158
N  -3.812233 -0.262182 -0.540931
C  0.520751 -1.476174 -0.303197
C  -0.97061 -1.359505 0.030159
C  -1.401822 0.114083 -0.033017
C  1.347993 -0.622438 0.677642
C  0.850328 0.838221 0.709486
C  -2.865239 0.356414 0.392969
C  1.143191 2.871336 -0.637451
H  0.705813 -1.099511 -1.334218
H  -1.572924 -1.944556 -0.686566
H  -1.151072 -1.766048 1.044393
H  -1.242635 0.509142 -1.057914
H  1.268564 -1.060765 1.687454
H  1.292467 1.409595 1.549311
H  -3.015851 1.451956 0.481985
H  -3.004205 -0.063102 1.407566
H  1.91738 -2.895955 -0.222972
H  2.91182 -0.025393 -0.399638
H  -4.206043 0.326987 -1.271739
H  -4.446756 -0.965808 -0.171434
H  1.777999 3.362837 0.127341
H  0.089393 3.167209 -0.483695
H  1.476426 3.166012 -1.644312
