program: Gaussian 09
title: 000191792
version: EM64L-G09RevD.01
frameworkgroup: C1[X(C12H17N5O5)]
method: RPBEPBE
basis: SDD
operation: Freq
keyword: #p
keyword: freq=noraman
keyword: PBEPBE/SDD
title: #p freq=noraman PBEPBE/SDD
converged: YES YES NO NO
title: Mulliken charges:
elementType: O O O O O N N N N N C C C C C C C C C C C C H H H H H H H H H H H H H H H H H
charge: -0.280632 -0.496853 -0.501653 -0.441022 -0.266901 -0.207749 -0.466372 -0.064464 -0.588814 -0.628462 -0.029648 -0.160246 -0.186853 -0.049862 0.339955 -0.390696 -0.382004 -0.144248 0.345404 -0.518110 -0.022557 0.140805 0.250726 0.292490 0.278340 0.244989 0.238007 0.233442 0.308831 0.394642 0.375286 0.374389 0.244908 0.225644 0.352489 0.271541 0.259960 0.346595 0.308703
chargesum: 0.00000
title: Mulliken charges with hydrogens summed into heavy atoms:
elementType: O O O O O N N N N N C C C C C C C C C C C C
charge: -0.280632 -0.102211 -0.126367 -0.088533 -0.266901 -0.207749 -0.091984 -0.064464 -0.057313 0.026836 0.221078 0.132244 0.091487 0.195127 0.339955 0.080753 -0.073173 -0.144248 0.345404 -0.047559 -0.022557 0.140805
polarizability: 2.31647371e+02 1.62143953e+00 2.12469310e+02 1.03713130e+01 -4.00334026e+00 1.06334252e+02
1716.lowfreq: -2.2884 0.0004 0.0005 0.0007 3.8506 7.6778 12.9955 26.6005 52.1150
frequency: 12.6579 26.3602 52.1113 59.0252 82.6483 85.7992 101.9968 117.7427 138.7158 165.8869 190.4863 193.4344 216.9616 226.3443 232.6261 242.0246 256.0735 259.1740 262.2195 289.7164 311.5090 313.6614 339.5912 344.6989 368.0541 397.6239 434.5516 464.8987 499.9004 514.7962 543.3720 563.9866 578.4667 597.0205 609.4755 624.9028 640.3386 653.6472 660.2766 692.4563 708.5168 734.7620 769.2307 780.8300 783.3972 802.7363 828.9852 886.0126 912.6280 937.6316 943.8601 956.9966 961.0150 993.9806 996.5762 1006.9300 1036.1035 1037.9373 1049.7302 1060.5303 1089.4617 1122.7850 1137.2729 1146.2230 1155.6334 1163.9611 1168.5925 1215.2016 1220.4807 1240.4505 1262.1355 1262.6531 1277.0038 1300.2263 1313.9390 1321.1323 1327.6478 1343.4212 1361.6232 1362.0428 1369.0622 1378.8137 1394.3045 1410.7240 1435.6088 1469.9548 1480.0746 1523.4280 1550.4933 1565.3851 1602.8085 1605.1283 1633.2194 1638.4941 2939.4418 2949.7827 3002.6643 3012.7353 3016.0558 3046.8923 3075.5849 3090.6352 3277.6185 3295.5298 3411.5106 3444.4779 3555.3537 3573.3571 3583.5835 3618.5971 3711.5784
redmass: 6.7391 5.5491 5.3139 4.5602 3.6657 4.6125 4.2540 4.4636 4.5771 4.1583 3.9943 4.9658 2.6506 4.6775 2.7553 1.2879 1.4107 1.9620 2.7459 1.4385 3.6666 3.4042 4.9274 3.9685 6.4753 5.1991 5.3330 3.7863 1.1094 6.9990 4.8833 4.9148 3.9648 1.4697 2.5480 4.2444 6.8506 2.9993 2.5303 9.5471 4.6175 3.0476 5.2201 1.5550 1.6477 2.0208 2.6733 2.2803 3.1910 5.1400 2.1387 2.9771 5.0439 2.9780 3.1925 3.5463 3.6397 3.0873 1.9527 2.9859 2.3397 2.8789 1.3750 1.4641 3.4068 1.3808 1.4361 2.2636 1.5974 1.4917 1.4094 1.3043 1.3239 1.5570 1.3272 2.4449 1.3302 1.6831 1.4625 1.4688 1.9095 1.4281 1.2511 3.9198 4.5071 1.0797 1.1305 6.3916 4.3151 3.7738 7.2120 1.4462 2.7786 1.1369 1.0670 1.0842 1.0930 1.0620 1.0857 1.0877 1.0884 1.1053 1.0977 1.0844 1.0643 1.0450 1.0448 1.0969 1.0670 1.0672 1.1054
irintensity: 0.2228 0.1516 4.1185 1.6274 8.1186 6.7125 9.9663 0.8566 5.4250 6.0423 26.5734 9.8793 17.3429 0.9859 35.3558 122.7909 84.9277 71.6466 20.2908 100.4335 12.2613 6.0228 4.2743 9.2443 10.2797 0.6999 5.0345 20.0399 159.1227 5.3457 10.4800 17.6496 16.9698 101.7888 55.3844 12.6573 10.8797 48.3746 57.9476 11.9366 17.4121 37.9013 68.8872 10.5085 76.6413 31.8048 35.6836 31.6969 1.9154 54.0276 15.8637 24.1094 87.1271 64.4870 106.8642 28.6144 96.1667 66.6055 11.9703 30.9371 6.0412 12.6662 17.4956 19.8675 12.5005 56.0410 4.6277 4.4011 61.9477 31.0983 46.2548 20.4464 6.5689 11.9786 14.4465 20.7477 21.7160 87.8116 8.5904 2.3240 176.3147 13.5703 39.2980 116.0219 59.5945 9.1431 1.6855 182.2516 94.3079 95.9433 465.5706 25.1870 573.4601 38.0001 28.0772 36.1052 27.0459 17.5896 46.9590 9.9593 10.1655 28.4879 5.8322 570.8666 79.7630 2.2033 89.8095 0.0581 15.0559 30.6828 42.5152
temp: 298.150 k
press: 1.00000 atm
elementType: 8 8 8 8 8 7 7 7 7 7 6 6 6 6 6 6 6 6 6 6 6 6 1 1 1 1 1 1 1 1 1 1 1 1 1 1 1 1 1
symmnumber: 1
zpe: 795566.9 jmol-1
zpe.correction: 0.303015 hartree
zpe.thermalcorrener: 0.324808 hartree
zpe.thermalcorrenthalpy: 0.325752 hartree
zpe.thermalcorrgfe: 0.251264 hartree
zpe.sumelectzpe: -1115.661352 hartree
zpe.sumelectthermal: -1115.639560 hartree
zpe.sumelectthermalent: -1115.638615 hartree
zpe.sumelectthermalfe: -1115.713104 hartree
dipole: -13.6461 -2.6224 -0.7204
dipole: 13.9144
quadrupole: -139.4865 -101.9666 -133.7083
quadrupole: 0.4624 2.7074 5.1677
quadrupole: -14.4327 23.0872 -8.6545 0.4624 2.7074 5.1677
hfenergy: -1115.9643676 hartree
pointgroup: C01 [X(C12H17N5O5)]
dipole: 5.2968726 -1.382016 -0.0428843 debye
polarizability: 232.0215966|-3.1164545|211.6339656|5.1238338|11.4670266|106.7953712 unknown
InChI: InChI=1S/C12H17N5O5/c13-1-4-2-17(9-6(4)10(21)16-12(14)15-9)11-8(20)7(19)5(3-18)22-11/h2,5,7-8,11,15,18-20H,1,3,13-14H2
charge 0 multiplicity 1
39 atoms
O  2.337888 0.844372 0.7363
O  1.424399 -2.605082 -0.165549
O  3.792271 -2.052376 0.706243
O  5.191935 0.950997 -1.706387
O  -4.610078 0.665839 -0.241784
N  0.03433 0.334086 0.426669
N  -1.232281 -1.755263 -0.093919
N  -3.614688 -1.458923 -0.437638
N  -1.689788 4.276236 0.402987
N  -2.636857 -3.576904 -0.63501
C  1.352837 -0.240965 0.707478
C  1.846867 -1.229061 -0.396775
C  3.38835 -1.08177 -0.331256
C  3.602815 0.384806 0.092236
C  -1.12031 -0.388283 0.146885
C  3.894305 1.306211 -1.109567
C  -0.347644 1.694933 0.624149
C  -2.22427 0.480316 0.124572
C  -1.72255 1.806623 0.43339
C  -2.544589 3.070766 0.52726
C  -3.561337 -0.049975 -0.187309
C  -2.525642 -2.217539 -0.38714
H  1.349931 -0.757022 1.692191
H  1.455564 -0.920742 -1.379754
H  3.890477 -1.304762 -1.289304
H  4.41239 0.46362 0.842769
H  3.852938 2.362513 -0.783255
H  3.147551 1.161007 -1.908026
H  0.389926 2.449023 0.873873
H  2.131487 -3.012265 0.413048
H  4.759008 -2.243182 0.649995
H  -0.397079 -2.366185 -0.079237
H  -3.371676 3.003336 -0.213296
H  -3.037239 3.108919 1.518951
H  5.918601 1.430769 -1.236987
H  -2.16221 5.140707 0.685344
H  -1.2614 4.366452 -0.525066
H  -3.569494 -3.918348 -0.851445
H  -1.83904 -4.205585 -0.659634
