program: Gaussian 09
title: 000182437
version: EM64L-G09RevD.01
frameworkgroup: C1[X(C11H20O6)]
method: RPBEPBE
basis: SDD
operation: Freq
keyword: #pfreq=noraman
keyword: PBEPBE/SDD
title: #p freq=noraman PBEPBE/SDD
converged: YES YES NO NO
title: Mulliken charges:
elementType: O O O O O O C C C C C C C C C C C H H H H H H H H H H H H H H H H H H H H
charge: -0.271122 -0.271084 -0.249852 -0.251757 -0.233832 -0.232829 -0.249647 -0.248885 -0.270517 -0.271103 -0.601093 -0.206609 -0.206916 0.288598 0.287591 -0.677078 -0.676995 0.186755 0.206930 0.187206 0.206242 0.225535 0.247742 0.225611 0.247377 0.264604 0.266525 0.192063 0.184785 0.192433 0.184635 0.202548 0.228177 0.231504 0.202702 0.228084 0.231675
chargesum: 0.00000
title: Mulliken charges with hydrogens summed into heavy atoms:
elementType: O O O O O O C C C C C C C C C C C
charge: -0.271122 -0.271084 -0.249852 -0.251757 -0.233832 -0.232829 0.144039 0.144562 0.202760 0.201885 -0.069964 0.170238 0.170151 0.288598 0.287591 -0.014850 -0.014535
polarizability: 1.85539814e+02 1.23142328e-01 1.33559632e+02 6.36865473e+00 6.18718469e-01 1.13540168e+02
1716.lowfreq: -4.0935 -0.6162 -0.0005 0.0006 0.0010 5.0167 14.2493 15.3168 21.6439
frequency: 8.0046 14.8852 21.5855 26.3052 33.4413 37.5895 60.7407 64.2039 91.1779 114.8997 117.4039 147.7526 159.0568 181.8406 186.1589 212.4808 236.3523 237.4938 239.8180 255.2715 285.7109 356.4847 392.2996 412.3443 413.1673 476.1606 477.3080 552.0206 587.0258 644.0761 760.9229 783.3141 789.7529 793.6131 816.7785 818.2497 835.8866 900.7201 921.4458 933.9372 946.3440 955.7381 1011.7960 1016.5323 1037.2264 1037.6612 1073.8744 1075.1363 1102.5712 1102.8644 1109.3327 1128.6599 1128.7401 1140.5629 1140.9491 1142.1300 1200.0693 1200.7529 1248.8742 1250.0979 1251.2578 1253.6488 1255.8616 1307.7035 1337.9728 1339.0038 1362.5715 1363.2533 1391.4938 1392.7349 1411.9170 1412.7097 1434.9248 1450.8030 1450.8739 1459.2425 1459.4552 1460.6214 1461.3751 1479.6375 1480.5488 1493.6656 1493.8002 1631.8133 1654.7123 2913.7865 2914.2159 2924.7559 2925.2544 2963.6932 2964.0907 2978.3701 2978.5636 2995.1648 2995.4192 3023.6243 3023.9850 3041.8384 3092.3912 3092.6992 3093.0742 3093.3600 3102.1712 3102.1901 3111.6071
redmass: 3.8615 5.2374 3.6415 7.7149 5.5015 4.0441 1.7221 1.7447 5.9244 6.2011 4.5720 3.4657 4.3180 3.0389 3.5386 2.5496 1.1855 1.2955 3.3172 3.5125 2.7263 3.5872 2.4060 2.8024 2.7580 3.2039 3.0155 5.3011 5.0191 4.7790 4.9676 2.6045 2.5101 3.0153 1.1119 1.1066 3.9056 4.8537 2.3227 2.6407 2.2474 3.6091 2.3981 2.7814 2.5531 2.5849 3.0765 3.1405 2.7126 2.6850 2.0282 2.0515 2.0234 1.7033 1.6234 2.3582 1.1081 1.1118 1.4673 1.2006 1.2230 1.1288 1.1376 1.6439 1.2386 1.2563 1.4186 1.4283 1.2449 1.2495 1.5337 1.5343 1.0878 1.0812 1.0809 1.0408 1.0410 1.0855 1.0855 1.0480 1.0484 1.0797 1.0787 10.3405 9.9353 1.0560 1.0560 1.0579 1.0578 1.1058 1.1059 1.1009 1.1010 1.0358 1.0359 1.0591 1.0591 1.0588 1.1069 1.1068 1.0992 1.0992 1.1010 1.1010 1.1025
irintensity: 2.7662 1.6799 0.0601 1.7093 0.1682 0.0313 1.4034 4.6905 0.7043 0.8982 16.4142 0.4834 0.4121 0.0429 10.4470 9.1446 0.8847 1.5594 5.9606 2.0344 4.2686 0.2504 9.2301 3.2126 1.5306 3.5497 23.2556 7.8982 5.4782 5.6640 4.5304 12.3367 4.7863 3.0440 2.9803 5.0071 3.6108 1.5488 5.7685 26.8623 38.6995 85.7111 0.6169 101.5681 8.8649 67.8278 210.1598 108.1558 27.5215 14.0597 4.9030 10.1120 13.5655 126.7822 82.7269 471.9921 0.4604 34.2192 4.3005 0.7896 2.4066 2.6423 1.5592 245.9616 33.3665 12.4156 5.1585 9.8330 23.6800 24.4484 2.1070 2.0533 24.8175 13.1669 17.0853 11.6222 11.3157 16.0329 15.1292 3.2884 3.5210 5.9032 5.6470 250.5179 139.2433 39.7632 37.1487 109.5338 107.1417 73.5664 72.2224 33.1343 32.3361 21.9306 23.4481 23.5767 24.9910 0.7191 15.7974 15.7658 38.3789 37.2899 54.3592 20.0489 1.8814
temp: 298.150 k
press: 1.00000 atm
elementType: 8 8 8 8 8 8 6 6 6 6 6 6 6 6 6 6 6 1 1 1 1 1 1 1 1 1 1 1 1 1 1 1 1 1 1 1 1
symmnumber: 1
zpe: 797128.3 jmol-1
zpe.correction: 0.303610 hartree
zpe.thermalcorrener: 0.324637 hartree
zpe.thermalcorrenthalpy: 0.325581 hartree
zpe.thermalcorrgfe: 0.246725 hartree
zpe.sumelectzpe: -881.097910 hartree
zpe.sumelectthermal: -881.076883 hartree
zpe.sumelectthermalent: -881.075939 hartree
zpe.sumelectthermalfe: -881.154795 hartree
dipole: 0.2033 1.0395 -0.1826
dipole: 1.0748
quadrupole: -60.0225 -103.0751 -106.6688
quadrupole: -0.9940 12.9261 0.6691
quadrupole: 29.8996 -13.1529 -16.7467 -0.9940 12.9261 0.6691
hfenergy: -881.4015198 hartree
pointgroup: C01 [X(C11H20O6)]
dipole: -0.0716502 0.4043465 0.1008707 debye
polarizability: 186.0766226|-0.6099348|133.5674267|1.077794|0.5705769|112.9955638 unknown
InChI: InChI=1S/C11H20O6/c1-3-14-5-7-16-10(12)9-11(13)17-8-6-15-4-2/h3-9H2,1-2H3
charge 0 multiplicity 1
37 atoms
O  5.137419 0.822224 -0.557591
O  -5.120086 0.846372 0.624311
O  2.331727 -0.182697 -0.222049
O  -2.344684 -0.165969 0.084431
O  0.9492 -1.40979 -1.642444
O  -0.857592 -1.458846 1.330735
C  4.733821 -0.46459 0.008291
C  -4.75852 -0.441955 0.03385
C  3.504687 -0.947897 -0.738852
C  -3.478726 -0.925269 0.690362
C  -0.01197 0.321625 -0.164905
C  6.268891 1.422548 0.16517
C  -6.296899 1.447528 -0.02125
C  1.100529 -0.528012 -0.76845
C  -1.073885 -0.54511 0.504841
C  6.605105 2.7433 -0.525619
C  -6.591003 2.764452 0.695571
H  5.550561 -1.21236 -0.115187
H  4.50842 -0.37148 1.093023
H  -5.564855 -1.188543 0.218165
H  -4.612152 -0.351916 -1.064659
H  3.318837 -2.023476 -0.567781
H  3.602648 -0.767678 -1.823416
H  -3.309467 -2.002411 0.512212
H  -3.495836 -0.73875 1.778164
H  -0.483899 0.920846 -0.960361
H  0.417643 1.004687 0.586599
H  5.987668 1.588502 1.229196
H  7.140385 0.729067 0.145344
H  -6.084778 1.618733 -1.10033
H  -7.16399 0.752007 0.051199
H  7.44913 3.24256 -0.015763
H  6.88416 2.568423 -1.578912
H  5.733143 3.419336 -0.506824
H  -7.466053 3.264308 0.241753
H  -6.803327 2.584364 1.763451
H  -5.723055 3.442269 0.625327
