program: Gaussian 09
title: 000017797
version: EM64L-G09RevD.01
frameworkgroup: C1[X(C10H5N3O2)]
method: RPBEPBE
basis: SDD
operation: Freq
keyword: #p
keyword: freq=noraman
keyword: PBEPBE/SDD
title: #p freq=noraman PBEPBE/SDD
converged: YES YES NO NO
title: Mulliken charges:
elementType: O O N N N C C C C C C C C C C H H H H H
charge: -0.194351 -0.180854 0.023116 0.021706 0.018897 0.526059 0.364915 -0.444275 -0.412025 -0.358743 -0.198070 -0.338823 0.302205 -0.236688 -0.251198 0.307470 0.246367 0.298085 0.251718 0.254491
chargesum: 0.00000
title: Mulliken charges with hydrogens summed into heavy atoms:
elementType: O O N N N C C C C C C C C C C
charge: -0.194351 -0.180854 0.023116 0.021706 0.018897 0.526059 0.364915 -0.136805 -0.165658 -0.060658 0.053648 -0.084332 0.302205 -0.236688 -0.251198
polarizability: 2.37106237e+02 -1.67717976e+01 1.57495269e+02 -8.45736530e-03 -8.19464647e-03 5.01602103e+01
1716.lowfreq: -3.4692 -0.0007 -0.0004 0.0004 1.8472 5.4902 25.3993 47.7558 81.4404
frequency: 25.3669 47.7534 81.4369 87.6658 132.5014 159.0122 168.8349 210.8948 264.0043 313.3077 365.8305 374.7748 420.2549 434.9343 435.2952 510.4291 540.5733 595.8374 620.2639 657.9412 659.1315 685.7496 702.4950 754.3802 794.9772 820.9138 923.8200 928.5538 953.9380 969.2999 987.0269 1007.9308 1089.7497 1094.2920 1148.4963 1183.7858 1209.5628 1237.1593 1297.9667 1363.9479 1381.8088 1406.4188 1440.4054 1476.8852 1574.0023 1595.9324 1612.3756 2169.5060 2179.6813 3121.2771 3138.7783 3167.2269 3188.4314 3190.2256
redmass: 10.4319 13.8038 12.0739 5.9654 12.4060 11.9919 5.3240 7.1147 8.7074 3.8558 6.4008 9.5797 3.8949 10.7201 6.2274 7.9513 5.1036 12.1093 7.1503 6.9459 8.3993 1.9814 6.6642 9.3847 7.8935 1.4685 4.9991 1.3385 1.4735 1.5650 6.2066 1.3792 1.7389 1.9424 3.8788 1.1781 8.0378 2.9051 1.3379 2.2436 11.4502 3.2633 2.7964 2.6168 6.4695 6.2117 6.8163 12.6204 12.6378 1.0897 1.0899 1.0929 1.0928 1.0965
irintensity: 0.0024 1.0435 1.5799 1.4427 4.9767 2.1197 0.2173 5.5600 0.5244 0.0423 0.5683 1.2701 1.6946 2.1826 0.1058 1.0645 4.8493 0.6681 7.4513 1.0790 15.0183 39.0774 8.8957 16.1308 9.7517 29.7037 1.7828 4.2422 13.8736 20.9281 1.6747 2.2329 26.8768 12.1079 11.0449 11.5503 206.3072 33.0463 2.6729 5.7244 78.8692 19.2121 15.3157 23.3414 19.4521 36.5462 8.0455 0.7789 19.5432 5.1831 4.7141 10.2154 4.7020 7.1299
temp: 298.150 k
press: 1.00000 atm
elementType: 8 8 7 7 7 6 6 6 6 6 6 6 6 6 6 1 1 1 1 1
symmnumber: 1
zpe: 340355.8 jmol-1
zpe.correction: 0.129635 hartree
zpe.thermalcorrener: 0.142470 hartree
zpe.thermalcorrenthalpy: 0.143414 hartree
zpe.thermalcorrgfe: 0.088452 hartree
zpe.sumelectzpe: -697.608475 hartree
zpe.sumelectthermal: -697.595640 hartree
zpe.sumelectthermalent: -697.594695 hartree
zpe.sumelectthermalfe: -697.649657 hartree
dipole: -1.7021 7.2288 0.0012
dipole: 7.4265
quadrupole: -115.5134 -86.4300 -85.2475
quadrupole: -7.0819 -0.0132 0.0139
quadrupole: -19.7831 9.3003 10.4828 -7.0819 -0.0132 0.0139
hfenergy: -697.7381093 hartree
pointgroup: C01 [X(C10H5N3O2)]
dipole: -0.5727353 -2.7430478 -0.8273981 debye
dipolederiv: -0.8796685 -0.0443413 0.0640017 0.1185536 -0.4180664 -0.0785617 0.117019 -0.0594157 -0.2523577 -0.5240588 0.0011269 0.0385272 0.0348196 -0.6501426 -0.1491735 0.0494093 -0.1455352 -0.2564355 1.3909452 -0.1368245 -0.1879937 -0.4073655 1.0750724 0.3371774 -0.275922 0.3057401 0.3169891 -0.3128645 -0.0354007 -0.0000911 0.0259723 -0.1783826 0.0088797 0.0199018 0.0160656 -0.2121308 -0.1651507 -0.0185784 -0.0108641 -0.1094124 -0.1792246 0.0217297 -0.0403364 0.0111039 -0.1981895 -0.3054786 -0.0081931 0.035948 0.061555 -0.1031081 -0.0487854 0.0580508 -0.0406255 0.0041304 -0.3166528 0.0870608 0.073977 0.0835542 -0.2406367 -0.1106029 0.0725308 -0.1112 0.0241465 0.1324354 -0.0888899 -0.0525648 -0.0745739 -0.0954888 0.000161 -0.047897 0.0019348 -0.0627916 0.1121735 -0.1135275 -0.0640457 0.1367227 0.0929175 0.0531014 0.0175331 0.0823061 -0.0944271 -0.0727889 0.0129408 0.0028106 -0.1444492 0.0639463 0.0660577 -0.0483723 0.0474409 -0.0652207 -0.2636416 0.1610214 0.0689629 0.2361735 0.1480946 0.0612658 0.0935639 0.0701775 -0.1123704 0.7812933 0.3119058 0.0021147 0.2607365 0.1594304 0.0430659 -0.0142706 0.0373007 -0.0529947 -0.1171584 -0.1584033 -0.0192092 -0.4416161 0.0760319 0.0249393 -0.1113773 -0.0082567 0.1686136 0.3072196 0.0541225 -0.0138085 0.0156396 -0.1063502 -0.048966 -0.0264168 -0.0535169 0.0243091 -0.1292963 -0.0493756 0.0050586 0.1359236 0.1094182 0.0028606 0.0652504 0.0245755 0.0518584 0.1684318 0.0000129 -0.0011139 -0.0293778 0.0829367 -0.0217488 -0.0104213 -0.0252435 0.1529669 0.0206262 0.0971406 0.0471474 0.062817 0.0441355 -0.0429013 0.0359773 -0.0468787 0.1335597 0.0734509 -0.0240776 0.0036622 -0.0022268 0.1456435 -0.0085941 0.0107432 -0.0059122 0.1694923 0.0588131 -0.0512382 -0.0049299 -0.0570742 -0.0383931 -0.0580422 -0.0068957 -0.0587276 0.1414302 0.0413701 0.0035181 0.0124103 0.0936284 0.0121663 -0.0518625 0.04193 -0.0413332 0.1194219 unknown
polarizability: 233.6393158|24.6182992|149.7431103|-13.5089895|29.5627101|61.3792904 unknown
InChI: InChI=1S/C10H5N3O2/c11-6-9(7-12)4-8-2-1-3-10(5-8)13(14)15/h1-5H
charge 0 multiplicity 1
20 atoms
O  -4.241197 0.657837 0.693308
O  -2.486871 2.093475 0.951885
N  -2.985821 0.948653 0.638683
N  5.092879 0.18752 -0.55712
N  1.706959 2.770781 0.678912
C  0.223274 -0.840272 -0.321674
C  -2.048916 -0.120194 0.179659
C  -0.676885 0.174571 0.115171
C  -0.312313 -2.117822 -0.6760
C  -2.584524 -1.379634 -0.169105
C  -1.693151 -2.38345 -0.601205
C  1.673426 -0.68161 -0.439755
C  2.490542 0.406552 -0.1815
C  3.913284 0.287368 -0.386622
C  2.043013 1.690957 0.288469
H  -0.3448 1.174748 0.4031
H  0.371046 -2.906056 -1.012963
H  -3.662408 -1.5461 -0.097585
H  -2.076247 -3.369833 -0.878557
H  2.20211 -1.577391 -0.793303
