program: Gaussian 09
title: 000191756
version: EM64L-G09RevD.01
frameworkgroup: C1[X(C12H7N5)]
method: RPBEPBE
basis: SDD
operation: Freq
keyword: #pfreq=noraman
keyword: PBEPBE/SDD
title: #p freq=noraman PBEPBE/SDD
converged: YES YES NO NO
title: Mulliken charges:
elementType: N N N N N C C C C C C C C C C C C H H H H H H H
charge: -0.262053 0.016281 -0.023511 -0.022185 0.011593 0.145073 0.076321 0.422416 -0.396827 -0.348538 -0.394513 0.125426 -0.223666 -0.200867 -0.241150 -0.365501 -0.163770 0.287027 0.308217 0.287176 0.231735 0.233596 0.234117 0.263603
chargesum: 0.00000
title: Mulliken charges with hydrogens summed into heavy atoms:
elementType: N N N N N C C C C C C C C C C C C
charge: -0.262053 0.016281 -0.023511 -0.022185 0.011593 0.145073 0.076321 0.422416 -0.109799 -0.040321 -0.107337 0.125426 0.008069 0.032729 -0.007032 -0.101899 -0.163770
polarizability: 2.76952288e+02 5.64769683e+00 1.67364520e+02 3.07230285e-02 -3.88010268e-02 6.07248663e+01
1716.lowfreq: -5.9053 -0.0006 -0.0005 0.0003 1.4608 5.8507 40.3732 47.5128 97.7406
frequency: 40.3401 47.5118 97.7384 124.9823 150.3864 201.3908 225.2614 290.6632 307.4333 335.4236 387.4951 409.4137 451.5212 460.2536 505.7361 575.8590 601.1532 612.3334 614.5657 635.0232 667.1957 678.8617 701.0831 703.0631 773.7439 801.4537 838.8217 851.1319 859.9415 934.0204 938.1329 943.6608 988.1438 993.9860 1006.2556 1011.0126 1020.4798 1039.5193 1095.6776 1116.0563 1174.6272 1191.2020 1205.5586 1241.8583 1260.4959 1280.3822 1325.0515 1333.5433 1379.6542 1391.3307 1408.9036 1414.2447 1450.3041 1488.5821 1505.4164 1553.9380 1598.4893 1610.7994 2192.8050 3135.3324 3147.3450 3165.1971 3179.8451 3182.0658 3190.4218 3231.3297
redmass: 4.2202 8.4141 8.7450 6.7134 6.9862 7.7703 6.4023 6.1117 5.1799 7.5117 11.6802 2.9607 7.7371 10.5065 3.3801 3.8055 8.4965 8.1819 6.7240 6.5006 9.9338 10.7719 2.1079 6.9613 1.6240 3.2574 9.1174 1.7226 1.2491 1.4512 7.2253 1.3983 6.2265 1.3571 1.3059 6.0716 5.0481 2.2841 1.5996 4.3014 1.0551 1.1943 2.1775 3.1894 8.3010 3.4568 3.5447 1.6380 3.6808 4.0044 4.2981 2.7932 2.4813 2.6604 7.6821 9.6819 6.8800 5.9350 12.6400 1.0857 1.0909 1.0968 1.0929 1.0961 1.0958 1.0984
irintensity: 0.0222 0.3423 0.6630 4.3483 2.8076 0.2003 1.1203 1.5605 3.0322 2.0215 0.2927 0.0002 0.1762 1.6577 2.8576 9.7341 1.8299 2.6290 1.5713 2.9549 13.4029 3.2911 38.1463 9.7589 69.5074 26.9273 11.9253 12.4549 0.0855 13.2539 68.2226 8.7765 0.2600 0.0469 1.8829 1.1796 6.7331 19.3197 20.0595 24.0097 0.2419 5.3889 12.4692 5.4406 14.4523 18.4778 46.7598 27.9941 21.1365 15.4085 105.5607 1.9501 15.1529 161.4572 21.8842 91.0120 5.2666 25.5475 0.9781 0.0049 19.8983 21.3787 7.0243 15.5329 4.7274 1.2462
temp: 298.150 k
press: 1.00000 atm
elementType: 7 7 7 7 7 6 6 6 6 6 6 6 6 6 6 6 6 1 1 1 1 1 1 1
symmnumber: 1
zpe: 444265.8 jmol-1
zpe.correction: 0.169212 hartree
zpe.thermalcorrener: 0.181652 hartree
zpe.thermalcorrenthalpy: 0.182596 hartree
zpe.thermalcorrgfe: 0.129295 hartree
zpe.sumelectzpe: -734.052733 hartree
zpe.sumelectthermal: -734.040293 hartree
zpe.sumelectthermalent: -734.039349 hartree
zpe.sumelectthermalfe: -734.092650 hartree
dipole: 4.3973 0.3830 0.0009
dipole: 4.4139
quadrupole: -111.9286 -91.5878 -99.7819
quadrupole: -1.1576 0.0014 -0.0326
quadrupole: -10.8292 9.5116 1.3175 -1.1576 0.0014 -0.0326
hfenergy: -734.2219448 hartree
pointgroup: C01 [X(C12H7N5)]
dipole: -1.7303873 -0.1461568 0.0080649 debye
dipolederiv: -0.7716137 0.153221 -0.0176224 -0.1645938 -0.4607565 0.0425313 0.0123225 0.0438412 -0.013083 0.056506 0.253522 -0.0236612 0.663477 0.0646741 -0.0204071 -0.061852 -0.0215508 -0.1715871 -0.6438848 0.1035607 -0.0117708 0.1773832 -0.4424456 0.0283194 -0.0200909 0.0284701 -0.1585763 -0.6150017 -0.1549119 0.0135264 -0.0492005 -0.6265707 0.0423437 0.0033815 0.04199 -0.192855 -0.1720566 0.0561399 -0.0053312 -0.0148818 -0.1622838 -0.0043334 0.0015662 -0.0040961 -0.2060804 1.0358363 -0.4688385 0.0488806 -0.279757 0.1597846 -0.0057918 0.0302426 -0.0066502 0.1126882 -0.768987 0.1053789 -0.013353 -0.6394103 -0.1863738 0.0230127 0.0587427 0.0256375 0.0723328 1.1031457 0.0600842 -0.0019401 0.182802 0.068935 -0.0003084 -0.0136453 -0.0009938 0.0536941 -0.4896169 -0.1208637 0.0101558 0.1429253 0.3073417 -0.0367702 -0.0154192 -0.037892 -0.0763148 -0.2210078 -0.0415937 0.0034427 -0.0701137 -0.0990254 -0.0041801 0.0063627 -0.0043803 -0.141961 -0.212058 0.056338 -0.0056794 0.0533534 -0.0147464 -0.0125947 -0.0053559 -0.0127754 -0.1506129 0.8063372 0.0131968 0.0008192 -0.0055992 0.6018856 -0.0374956 0.0027069 -0.0374115 0.2197316 -0.0369872 0.0737814 -0.0066725 0.1377002 0.1375977 -0.0259557 -0.0123799 -0.0263521 -0.1466639 0.0442417 -0.1045151 0.0102794 -0.1700682 0.0811775 -0.0216886 0.0161259 -0.0214866 -0.1459205 0.0152842 0.0333851 -0.0026711 0.0208736 -0.0646474 -0.0085121 -0.0013192 -0.0083393 -0.1548431 0.5654057 0.1012262 -0.0076905 0.0280038 0.600807 -0.0612016 -0.0003585 -0.0609942 -0.0249401 -0.0992273 -0.0815238 0.0075328 0.0086104 -0.0562978 0.0066836 -0.0012987 0.0064143 0.0117824 0.0660133 -0.0292515 0.0024274 -0.008426 0.0539371 0.0116381 0.0002977 0.0115534 0.1741298 0.2053385 0.0475345 -0.0038946 0.0572172 0.0684952 0.0091976 -0.0043747 0.0093339 0.1658662 0.1597834 -0.0553173 0.0051206 -0.0550378 0.0241486 0.013432 0.0048415 0.0135332 0.170768 0.0435637 -0.0501021 0.0042655 -0.08903 -0.0809026 0.0216135 0.0078809 0.0217856 0.1541565 -0.0197886 0.0904193 -0.0088834 0.1137748 -0.0276697 0.0173829 -0.0110019 0.0173189 0.154963 -0.1308639 -0.0349712 0.0023636 -0.0382385 0.0905081 0.0067398 0.0026535 0.0067823 0.1640327 0.0796379 -0.0058993 0.0003566 -0.0017639 -0.0375723 0.0163447 -0.0000287 0.0162621 0.1292926 unknown
polarizability: 276.9779285|5.4134825|166.3828303|0.2349691|-10.0370136|61.6809155 unknown
InChI: InChI=1S/C12H7N5/c13-6-11-10-7-16-17(12(10)15-8-14-11)9-4-2-1-3-5-9/h1-5,7-8H
charge 0 multiplicity 1
24 atoms
N  -0.566774 0.496206 -0.053407
N  -0.127084 1.830876 -0.179905
N  0.534977 -1.722807 0.165305
N  2.989187 -1.59258 0.162046
N  5.226363 1.09285 -0.090379
C  0.520664 -0.365847 0.033863
C  1.704822 0.456268 -0.041084
C  -1.980821 0.227404 -0.032673
C  1.224751 1.800523 -0.172097
C  -2.454867 -1.102335 0.089118
C  -2.882743 1.314566 -0.135987
C  2.946486 -0.230076 0.029805
C  -3.847009 -1.33295 0.106458
C  -4.269424 1.062139 -0.116517
C  -4.760037 -0.259099 0.004495
C  1.786496 -2.256538 0.221895
C  4.201617 0.482047 -0.034758
H  1.785312 2.728968 -0.259354
H  -1.747285 -1.930396 0.167977
H  -2.491998 2.329967 -0.228983
H  -4.215394 -2.360145 0.200336
H  -4.967618 1.902216 -0.196179
H  -5.838633 -0.447871 0.018862
H  1.84821 -3.342783 0.327564
