program: Gaussian 09
title: 000182405
version: EM64L-G09RevD.01
frameworkgroup: C1[X(C23H24O13)]
method: RPBEPBE
basis: SDD
operation: Freq
keyword: #p
keyword: freq=noraman
keyword: PBEPBE/SDD
title: #p freq=noraman PBEPBE/SDD
converged: YES YES NO NO
title: Mulliken charges:
elementType: O O O O O O O O O O O O O C C C C C C C C C C C C C C C C C C C C C C C H H H H H H H H H H H H H H H H H H H H H H H H
charge: -0.286142 -0.281426 -0.432861 -0.474946 -0.446713 -0.456103 -0.285558 -0.258348 -0.485685 -0.313031 -0.375382 -0.432177 -0.472294 -0.104767 -0.135551 -0.109629 -0.034237 -0.055155 -0.413125 0.002062 0.175509 0.269366 0.002095 0.284596 -0.581215 0.189887 0.129450 0.111846 0.342035 -0.523539 -0.472330 -0.376102 0.184434 -0.337374 0.132584 -0.518024 0.219638 0.223403 0.238426 0.215058 0.234016 0.233431 0.239159 0.356513 0.361997 0.396486 0.360558 0.288702 0.399217 0.291387 0.226426 0.232365 0.289351 0.301982 0.227117 0.229143 0.217249 0.290390 0.386527 0.379309
chargesum: 0.00000
title: Mulliken charges with hydrogens summed into heavy atoms:
elementType: O O O O O O O O O O O O O C C C C C C C C C C C C C C C C C C C C C C C
charge: -0.286142 -0.281426 -0.076347 -0.112949 -0.050227 -0.095545 -0.285558 -0.258348 -0.086468 -0.313031 -0.375382 -0.045650 -0.092985 0.114871 0.087852 0.128797 0.180821 0.178861 0.059465 0.002062 0.175509 0.269366 0.002095 0.284596 -0.292513 0.189887 0.129450 0.111846 0.342035 0.226638 -0.182979 -0.074120 0.184434 -0.110257 0.132584 0.218758
polarizability: 5.54008118e+02 -1.10427955e+01 3.38292873e+02 3.67513038e+01 1.07777120e+01 1.78695966e+02
1716.lowfreq: -2.2756 -0.0008 -0.0004 -0.0003 1.7352 4.8703 13.9011 15.5411 28.0539
frequency: 13.5526 15.0583 28.0396 35.8549 40.5465 57.0767 66.2991 72.3342 79.1432 85.8124 92.1648 93.8470 108.6318 132.6865 135.7709 149.1043 153.9842 165.9349 181.3213 197.0158 206.5411 208.9594 217.7834 236.2457 248.9291 250.4019 259.3448 266.2562 271.1623 281.5295 285.4565 294.6325 305.4850 310.4713 319.0679 324.5318 328.4883 342.7091 353.0093 377.2971 392.2893 403.4763 419.3573 423.0430 433.7016 438.7935 449.7014 456.2706 464.5865 476.8109 481.6935 499.0374 537.4498 552.8277 553.3390 558.0131 568.8232 579.8255 581.5449 590.9993 601.4953 615.0984 623.3450 630.1496 637.4252 645.8825 665.6565 701.0427 717.3819 727.3594 753.6574 763.0904 793.0114 803.0061 815.7417 837.3438 882.1236 889.0255 901.3255 918.0491 925.0894 936.3766 946.1592 957.4761 962.8261 975.4637 985.9926 1004.1116 1018.2777 1036.7987 1039.0451 1040.7384 1052.3797 1057.7477 1076.0590 1076.9477 1079.8926 1088.5714 1109.3782 1116.3767 1132.1236 1137.4185 1150.7672 1153.8006 1154.6745 1167.3402 1171.8794 1179.0921 1193.1140 1204.6490 1208.0516 1246.3883 1247.5910 1254.6659 1261.4513 1278.6745 1285.9795 1288.7445 1308.7340 1310.3310 1319.7807 1321.7657 1327.7173 1340.1088 1340.6447 1360.0363 1362.1142 1377.4124 1379.6947 1394.0730 1398.4648 1404.5100 1421.9103 1424.5703 1436.3924 1441.9878 1450.0654 1455.3278 1455.4075 1465.7517 1472.1008 1480.8509 1484.9910 1502.4028 1532.9804 1566.8174 1574.0966 1594.4320 1627.6439 1657.5309 2353.6646 2934.4279 2959.0394 2961.5762 2973.0485 2988.2168 2990.2539 3002.6413 3012.1247 3100.5669 3103.2039 3116.9691 3127.9409 3138.2472 3141.5959 3195.0451 3195.1672 3208.0946 3336.0312 3407.1807 3532.8490 3540.6917 3580.4839 3617.2061
redmass: 6.2072 7.5836 5.3904 5.9933 6.6774 6.1278 5.4008 5.0017 5.2628 4.6259 2.7841 4.3961 4.9210 7.0691 5.0962 2.6528 1.7568 3.6633 3.8783 3.7712 3.9949 3.2540 2.3226 6.2403 5.2435 6.5959 5.4344 3.9700 3.7151 1.6357 5.2977 3.4355 7.1106 4.2202 1.4114 3.4416 4.6630 6.5708 7.5917 4.1471 8.1717 2.5790 2.9962 2.3676 3.5070 4.9097 5.6118 5.4135 6.1502 5.3064 1.1180 9.6322 3.5322 6.5163 4.9128 5.6013 5.5591 7.0629 3.6252 5.3825 4.2424 1.2541 7.2153 1.1840 5.3405 8.1448 6.1472 5.8947 5.4218 4.0573 9.2582 6.3467 8.1730 1.4181 7.8491 1.5748 7.7316 1.8288 1.5269 8.5125 8.1848 6.9796 1.3339 4.5527 6.1979 4.5444 6.5280 5.9768 3.9844 1.1133 3.4625 3.0562 7.3272 1.9778 2.7372 2.9674 3.5293 2.5571 1.2430 1.2562 2.6141 2.1633 1.7634 1.4690 1.3491 1.7425 1.7158 2.2314 1.5110 1.3719 3.5720 1.1588 1.1992 1.1512 2.2516 2.7279 1.1701 1.1719 2.3745 1.2477 3.4641 1.2159 1.2643 1.3184 2.8906 1.4584 1.2443 1.4175 3.9208 5.5861 4.0277 1.6335 2.8840 1.4778 2.0183 1.7223 1.9420 1.3357 1.0993 2.3558 1.0840 1.0632 1.0590 3.7921 7.1372 6.1711 3.3727 7.0516 6.7414 4.1219 1.0804 1.0823 1.0832 1.0829 1.0847 1.0326 1.0855 1.0291 1.0625 1.1039 1.0998 1.1042 1.0912 1.1065 1.1061 1.0926 1.0919 1.0938 1.0683 1.0660 1.0650 1.0653 1.0665 1.0666
irintensity: 1.8297 0.1070 1.5913 0.4660 1.5881 0.2343 7.0949 0.2226 1.5189 5.5030 2.8863 2.1385 4.6223 3.5415 7.3093 9.6149 0.1331 1.6077 0.4750 21.0615 0.2290 5.1895 1.5318 1.5317 1.3621 3.5081 3.4155 17.6448 55.6669 89.1616 5.8835 25.8598 6.9355 25.4334 139.1579 26.5736 14.6139 14.8980 10.4452 27.7148 39.6982 29.9432 23.1119 65.7441 18.6473 32.3870 4.1780 7.5511 10.1444 3.5488 137.8724 23.8898 22.1529 10.8669 74.4023 5.6351 47.3086 2.4588 20.0145 8.4475 6.9420 220.8766 2.2261 181.1842 21.1140 13.6913 6.9787 3.5245 1.2084 2.7940 10.2528 65.6609 26.8802 42.4700 7.7358 43.0609 60.8148 14.5733 26.8413 134.7906 164.1163 99.2999 1.6048 213.5836 28.6855 74.4852 152.2846 84.4199 4.8750 140.5447 23.0567 84.0174 26.4437 3.1499 231.6369 5.0212 133.3103 37.6052 21.1829 1.0513 1.7239 95.1948 38.3530 20.0979 6.7008 67.5834 110.8953 314.7813 38.5462 0.5322 203.3404 9.6922 14.5312 31.8185 101.7444 348.5339 6.4980 2.7561 248.8249 13.3203 61.5092 28.2606 73.9876 14.2697 468.6283 2.3957 8.5641 22.7381 74.7572 50.9148 134.5596 28.2685 282.3191 14.0547 249.3998 158.7516 11.2918 20.1852 14.8838 131.2640 3.4848 34.2790 29.4762 163.3943 127.5959 344.9370 66.9740 31.5357 38.9233 379.7118 745.7671 19.9313 5.2181 9.2268 26.9454 70.0191 101.7926 73.0978 32.7810 19.0270 30.1567 20.4720 21.4989 6.3196 6.3419 2.0111 0.9445 8.1734 571.3280 127.4089 110.4740 16.4163 19.2845 134.1288
temp: 298.150 k
press: 1.00000 atm
elementType: 8 8 8 8 8 8 8 8 8 8 8 8 8 6 6 6 6 6 6 6 6 6 6 6 6 6 6 6 6 6 6 6 6 6 6 6 1 1 1 1 1 1 1 1 1 1 1 1 1 1 1 1 1 1 1 1 1 1 1 1
symmnumber: 1
zpe: 1172844.6 jmol-1
zpe.correction: 0.446713 hartree
zpe.thermalcorrener: 0.481305 hartree
zpe.thermalcorrenthalpy: 0.482249 hartree
zpe.thermalcorrgfe: 0.379517 hartree
zpe.sumelectzpe: -1866.003525 hartree
zpe.sumelectthermal: -1865.968933 hartree
zpe.sumelectthermalent: -1865.967989 hartree
zpe.sumelectthermalfe: -1866.070722 hartree
dipole: 7.9671 -4.0158 3.9935
dipole: 9.7749
quadrupole: -162.8650 -220.0701 -199.3860
quadrupole: 39.9673 -2.0099 6.7294
quadrupole: 31.2420 -25.9630 -5.2790 39.9673 -2.0099 6.7294
hfenergy: -1866.4502384 hartree
pointgroup: C01 [X(C23H24O13)]
dipole: -3.2144428 1.5539795 1.4291188 debye
polarizability: 556.6422863|-8.4228796|337.9793833|-20.561563|-12.2565662|176.3752881 unknown
InChI: InChI=1S/C23H24O13/c1-32-12-6-11-14(16(28)21(12)36-23-19(31)18(30)15(27)13(7-24)35-23)17(29)22(33-2)20(34-11)8-3-4-9(25)10(26)5-8/h3-6,13,15,18-19,23-28,30-31H,7H2,1-2H3
charge 0 multiplicity 1
60 atoms
O  4.342767 1.28527 0.149656
O  2.891019 0.163725 -1.295393
O  6.930418 -2.029409 0.028298
O  7.450264 0.061703 1.898774
O  4.013976 -2.433717 -0.277815
O  6.905147 2.739172 2.436293
O  -2.672601 0.714888 -0.558362
O  1.473631 2.807354 -1.532343
O  1.300128 -2.065189 -0.803024
O  -3.787529 -2.757768 0.057388
O  -0.940249 -3.07128 -0.34861
O  -6.80532 3.189439 0.339141
O  -8.863228 1.438765 0.324746
C  5.882321 -1.173201 0.581651
C  6.452571 0.23306 0.835883
C  4.707528 -1.162934 -0.407341
C  5.336855 1.218313 1.243016
C  3.707851 -0.020975 -0.097629
C  5.839279 2.664128 1.409119
C  1.497692 0.333159 -1.101741
C  0.713972 -0.818946 -0.857271
C  0.854824 1.608613 -1.227586
C  -0.699019 -0.707739 -0.646939
C  -1.289256 0.578566 -0.73263
C  -0.547634 1.725556 -1.023769
C  -1.503062 -1.885133 -0.384117
C  -3.491813 -0.391144 -0.264998
C  -2.932208 -1.675773 -0.167125
C  -4.897825 0.015286 -0.109615
C  2.793861 2.855937 -2.21039
C  -5.199163 1.402876 0.041334
C  -5.967122 -0.927965 -0.12547
C  -6.524868 1.830093 0.184475
C  -7.300701 -0.493466 0.015101
C  -7.580904 0.876411 0.172359
C  -3.390244 -3.747373 1.095904
H  5.519785 -1.574181 1.55374
H  6.928536 0.609711 -0.095944
H  5.095841 -1.001138 -1.435265
H  4.854523 0.862583 2.183051
H  3.066877 -0.292436 0.769957
H  4.998714 3.340945 1.652183
H  6.315613 3.00463 0.475504
H  7.690473 -1.99469 0.666296
H  7.726814 0.97654 2.191433
H  3.105932 -2.367145 -0.699229
H  6.498115 2.760546 3.338137
H  -1.021719 2.703085 -1.125645
H  0.506581 -2.753846 -0.612054
H  3.597908 2.588365 -1.509867
H  2.876513 3.902539 -2.541338
H  2.808356 2.172837 -3.076609
H  -4.403589 2.149975 0.048134
H  -5.745502 -1.986748 -0.255997
H  -8.116554 -1.226442 -0.00521
H  -4.215731 -4.474432 1.111139
H  -3.304254 -3.247576 2.078636
H  -2.44007 -4.226613 0.817044
H  -7.787384 3.311911 0.423864
H  -9.576935 0.757175 0.30537
