program: Gaussian 09
title: 000191784
version: EM64L-G09RevD.01
frameworkgroup: C1[X(C17H27NO4)]
method: RPBEPBE
basis: SDD
operation: Freq
keyword: #p
keyword: freq=noraman
keyword: PBEPBE/SDD
title: #p freq=noraman PBEPBE/SDD
converged: YES YES NO NO
title: Mulliken charges:
elementType: O O O O N C C C C C C C C C C C C C C C C C H H H H H H H H H H H H H H H H H H H H H H H H H H H
charge: -0.316901 -0.432663 -0.443782 -0.450654 -0.352653 -0.025504 -0.454355 -0.419474 -0.511079 0.071658 0.307166 0.257602 0.266695 -0.380158 -0.112358 -0.448968 -0.320840 -0.373647 -0.241615 -0.718037 -0.697835 -0.687512 0.220497 0.216453 0.205485 0.241520 0.226943 0.229558 0.278191 0.225068 0.229199 0.233448 0.258449 0.238082 0.231471 0.254019 0.226480 0.202027 0.208298 0.230036 0.221879 0.219519 0.207230 0.215203 0.210959 0.205436 0.353550 0.348896 0.347021
chargesum: 0.00000
title: Mulliken charges with hydrogens summed into heavy atoms:
elementType: O O O O N C C C C C C C C C C C C C C C C C
charge: -0.316901 -0.079113 -0.094886 -0.103633 -0.094204 -0.025504 -0.017405 0.027530 -0.054578 0.071658 0.307166 0.257602 0.266695 -0.101967 0.121090 0.005298 0.148712 -0.119628 -0.015135 -0.077676 -0.049207 -0.055914
polarizability: 2.56667498e+02 1.04348491e+00 2.03212777e+02 1.38160048e+01 1.91452711e+00 1.57406964e+02
1716.lowfreq: -9.2431 -0.0006 0.0006 0.0007 4.0677 5.2204 16.4209 18.7462 30.0783
frequency: 16.2963 18.6711 29.8490 48.5464 68.5667 77.7163 82.7354 98.7544 136.8126 165.1311 180.1042 186.5033 230.1013 238.9570 245.3568 255.9754 260.9824 269.6629 273.0064 291.4139 303.7567 317.3643 328.7296 334.5606 351.6369 379.7565 402.1938 406.4929 414.8809 421.1695 423.2772 448.2094 477.4064 481.8203 510.1503 516.2172 528.9508 550.5101 586.1732 609.3564 611.8753 623.4561 679.0894 721.7554 722.8455 782.0521 794.6202 810.8101 835.9328 845.5304 863.1494 871.8682 888.0391 897.9559 903.4425 915.2924 920.9970 926.8418 940.1467 958.8910 972.7962 991.0838 1015.6387 1023.4187 1031.5210 1043.5591 1077.5254 1084.4655 1088.6397 1092.1306 1099.5363 1129.5150 1159.3582 1174.4728 1180.6461 1183.2858 1195.1187 1209.9307 1215.9924 1225.2698 1233.7050 1240.7529 1244.8169 1252.5534 1269.0885 1279.7383 1320.6950 1330.1370 1345.5822 1349.2167 1358.2820 1361.0654 1372.2383 1372.8226 1377.0424 1383.8807 1390.2845 1396.9584 1443.8100 1445.2288 1449.9471 1453.8478 1457.0410 1458.0157 1461.9622 1464.9060 1465.7351 1469.0292 1475.8208 1481.8006 1488.4511 1494.7486 1594.0690 1605.4201 2961.0820 2967.5624 2971.8667 2976.0056 2981.1971 2981.8190 2996.2557 3005.3326 3028.7119 3033.6060 3054.0970 3055.8654 3061.6165 3064.4157 3067.2649 3069.6464 3071.2054 3077.7841 3083.9013 3092.3004 3137.3104 3163.2967 3173.6230 3470.0433 3533.4603 3544.2459 3550.0876
redmass: 4.4516 4.4851 3.0349 4.9333 3.6336 4.1484 4.2566 3.3984 4.5208 4.4325 3.8730 1.0395 2.2646 2.3319 1.7595 2.9613 1.7653 1.2781 2.2133 3.6609 2.9545 2.2873 1.4960 2.2845 2.2990 2.3781 2.2987 1.5126 1.5819 2.1704 1.9998 2.1008 3.7079 2.8723 3.2896 2.5667 3.7767 3.7540 3.8846 2.3515 2.7244 4.5644 4.6523 2.5364 3.0506 2.7716 2.0755 4.1317 3.4366 2.4725 1.9177 2.5168 1.5363 1.7555 1.8996 2.4276 1.7152 2.3258 1.2136 3.6980 1.3177 1.9028 1.4257 1.4748 2.2694 3.0224 2.1477 2.1380 2.0183 2.5289 1.6723 2.4978 1.2245 1.8061 1.2440 1.2449 1.6665 2.5099 1.9176 1.5940 2.1204 2.8715 1.4442 1.2858 1.4199 1.8187 1.3281 1.5751 1.5693 1.3074 1.4503 1.3652 1.2255 1.2275 1.3965 2.1166 4.2941 1.2163 1.2837 1.2055 1.5219 1.0874 1.1668 1.0621 1.0702 1.3153 1.1085 1.1587 2.0066 1.0645 1.1097 1.0601 6.9994 7.2446 1.0667 1.0359 1.0368 1.0565 1.0367 1.0545 1.0594 1.0633 1.0905 1.1010 1.1078 1.1025 1.0986 1.0904 1.0980 1.0986 1.1033 1.0986 1.1003 1.0996 1.0869 1.0913 1.0977 1.0754 1.0652 1.0657 1.0650
irintensity: 0.1556 0.1112 0.1993 0.0186 0.0354 0.8683 1.2283 0.5609 1.2153 3.6216 3.6481 0.1477 3.0623 2.6799 4.4118 0.5578 3.5071 0.5769 1.8160 13.2653 0.4889 27.3312 74.2051 4.3746 14.0530 0.4668 30.0808 54.0301 102.2776 21.5854 43.0346 0.4291 7.4804 49.6316 14.5833 78.9177 18.2749 8.5775 19.3663 21.7148 33.9759 1.4824 2.0438 7.8903 3.9724 35.0820 57.8301 25.0139 28.8124 11.5483 45.0104 7.0318 18.7305 3.6892 33.7886 41.5762 0.6159 32.4997 0.7297 190.4175 2.6798 60.3840 1.8414 8.2368 60.0817 13.7952 17.0460 39.8584 2.3261 17.1277 50.3712 27.9057 19.4679 41.1626 7.0987 21.6878 78.9141 82.7784 29.4747 20.5442 203.2118 21.4927 14.6363 17.0813 8.1798 11.9963 4.5622 10.7177 5.3566 0.9176 3.8543 2.7640 16.2787 25.0682 51.2501 109.7438 1.8172 23.9248 48.8911 10.1008 92.5421 4.3148 14.4553 0.6035 1.9867 1.2698 0.0382 17.2229 8.1397 16.4070 9.5917 15.1022 56.4667 3.7126 24.6862 19.1707 40.2531 44.3376 8.2772 22.2300 26.2246 39.3557 31.4381 19.9534 21.5589 30.5017 2.6477 24.5645 48.4038 59.9576 36.2337 61.9520 11.5237 73.4792 10.3131 7.3061 14.4112 0.3394 14.4187 5.3967 5.3828
temp: 298.150 k
press: 1.00000 atm
elementType: 8 8 8 8 7 6 6 6 6 6 6 6 6 6 6 6 6 6 6 6 6 6 1 1 1 1 1 1 1 1 1 1 1 1 1 1 1 1 1 1 1 1 1 1 1 1 1 1 1
symmnumber: 1
zpe: 1091224.8 jmol-1
zpe.correction: 0.415626 hartree
zpe.thermalcorrener: 0.439270 hartree
zpe.thermalcorrenthalpy: 0.440214 hartree
zpe.thermalcorrgfe: 0.361765 hartree
zpe.sumelectzpe: -1017.916098 hartree
zpe.sumelectthermal: -1017.892454 hartree
zpe.sumelectthermalent: -1017.891509 hartree
zpe.sumelectthermalfe: -1017.969959 hartree
dipole: 0.8881 0.5203 -1.8215
dipole: 2.0922
quadrupole: -125.7341 -128.0716 -140.8703
quadrupole: 3.2756 -5.3703 9.2811
quadrupole: 5.8246 3.4871 -9.3116 3.2756 -5.3703 9.2811
hfenergy: -1018.3317238 hartree
pointgroup: C01 [X(C17H27N1O4)]
dipole: 0.2639938 -0.4532447 -0.6343712 debye
polarizability: 258.4009271|3.6085329|176.1046837|-0.3045714|-23.6918891|182.7816285 unknown
InChI: InChI=1S/C17H27NO4/c1-16(2,3)18-10-12(19)11-22-15-8-4-7-14-13(15)6-5-9-17(14,20)21/h4,7-8,12,18-21H,5-6,9-11H2,1-3H3
charge 0 multiplicity 1
49 atoms
O  0.325438 0.513173 0.512877
O  -5.260593 0.388764 1.253796
O  -5.371481 -0.762526 -0.840184
O  2.351042 0.978102 2.393269
N  3.489477 -0.921779 -0.691069
C  -4.513624 -0.474363 0.311748
C  -4.187187 -1.740812 1.113513
C  -3.107206 -1.438584 2.170296
C  -1.79658 -0.971351 1.500385
C  -2.01507 0.040685 0.383405
C  -3.280017 0.250534 -0.221284
C  -0.906032 0.786662 -0.112728
C  4.934359 -1.205966 -0.95777
C  -3.432151 1.17465 -1.2877
C  2.666242 0.777479 0.969703
C  3.025586 -0.708294 0.695733
C  1.519948 1.276124 0.084805
C  -1.050351 1.720657 -1.163028
C  -2.322581 1.905323 -1.750388
C  5.085997 -1.306906 -2.49555
C  5.799622 -0.034132 -0.431704
C  5.40407 -2.542128 -0.303792
H  -3.839523 -2.518041 0.406971
H  -5.117495 -2.098906 1.594115
H  -2.911389 -2.336454 2.785026
H  -3.491424 -0.649782 2.842405
H  -1.258838 -1.845916 1.076928
H  -1.110986 -0.543752 2.25545
H  -4.410426 1.276237 -1.766146
H  2.1239 -1.319452 0.896788
H  3.784326 -1.003597 1.446743
H  3.552011 1.407257 0.778276
H  2.88737 -1.568445 -1.213461
H  1.751541 1.070255 -0.977718
H  1.339663 2.356556 0.245471
H  -0.192673 2.288991 -1.532804
H  -2.436863 2.613926 -2.577771
H  4.46234 -2.126737 -2.903178
H  6.135379 -1.513198 -2.772482
H  4.770755 -0.36311 -2.974288
H  5.719902 0.073358 0.665552
H  5.483603 0.915453 -0.899461
H  6.863862 -0.207991 -0.673606
H  5.260484 -2.523921 0.792486
H  6.477293 -2.726698 -0.498145
H  4.830275 -3.396245 -0.710892
H  -5.324626 1.295966 0.856373
H  -6.205392 -1.170534 -0.489844
H  1.42912 0.637972 2.536479
