program: Gaussian 09
title: 000182372
version: EM64L-G09RevD.01
frameworkgroup: C1[X(C21H20N2O4)]
method: RPBEPBE
basis: SDD
operation: Freq
keyword: #p
keyword: freq=noraman
keyword: PBEPBE/SDD
title: #p freq=noraman PBEPBE/SDD
converged: YES YES NO NO
title: Mulliken charges:
elementType: O O O O N N C C C C C C C C C C C C C C C C C C C C C H H H H H H H H H H H H H H H H H H H H
charge: -0.275227 -0.249168 -0.225873 -0.238600 -0.336254 -0.024009 0.255122 -0.045144 0.298747 -0.072277 0.433318 0.166192 -0.369126 -0.359129 -0.332701 -0.382766 0.196851 -0.242917 -0.231162 -0.217762 -0.210377 -0.238056 -0.242984 -0.261022 -0.256965 -0.667742 -0.665333 0.273713 0.255770 0.269068 0.281176 0.232238 0.232395 0.231932 0.232894 0.232907 0.232872 0.244039 0.218996 0.236243 0.223734 0.229844 0.253634 0.216559 0.231365 0.249794 0.215190
chargesum: 0.00000
title: Mulliken charges with hydrogens summed into heavy atoms:
elementType: O O O O N N C C C C C C C C C C C C C C C C C C C C C
charge: -0.275227 -0.249168 -0.225873 -0.238600 -0.336254 -0.024009 0.255122 -0.045144 0.298747 -0.072277 0.433318 0.166192 -0.095413 -0.103359 -0.063633 -0.101591 0.196851 -0.010679 0.001233 0.014170 0.022517 -0.005148 -0.010112 0.202014 0.203012 0.032295 0.031016
polarizability: 3.25743375e+02 -4.86741669e+00 3.00085421e+02 -9.84676590e+00 -2.52375399e+01 1.64234961e+02
1716.lowfreq: -8.2675 -2.7329 -0.0006 0.0006 0.0008 5.8376 13.2063 24.5852 34.9805
frequency: 12.1846 24.5479 34.9708 38.6519 43.5688 51.6256 58.5706 61.6200 75.1074 86.8970 92.4769 109.0565 127.2487 147.5216 158.8955 196.4241 198.7326 209.4494 234.0217 240.8921 251.5114 276.8256 301.4175 313.5614 343.1257 360.2416 399.2822 405.1198 408.2994 430.0764 443.5241 477.1195 491.4762 527.7507 541.3241 609.9993 614.4319 620.4892 638.7032 670.7045 681.8609 693.4399 702.7656 707.6348 729.2544 737.3784 752.4371 768.9028 783.5402 787.5023 813.5334 820.2584 826.1663 842.6764 845.0444 856.4855 920.7334 932.1106 955.8473 974.3666 980.6995 986.6108 989.3718 990.2289 994.5993 999.9272 1006.2319 1021.4839 1025.0996 1033.3615 1065.7318 1081.6045 1086.1158 1095.5230 1095.8429 1122.2049 1144.6866 1156.3001 1157.3311 1173.8582 1174.7361 1187.6323 1196.1518 1210.6248 1276.9395 1277.7017 1294.1043 1319.8821 1323.7993 1343.7894 1350.2666 1355.0846 1372.8116 1385.5200 1389.8405 1390.7393 1403.7432 1433.8891 1444.9266 1450.5521 1457.0293 1460.6892 1462.0877 1464.5133 1477.6381 1484.0002 1485.6299 1487.8260 1536.2902 1583.4523 1598.5113 1609.0103 1614.6256 1619.3244 1639.5161 2991.9745 2993.1064 3030.8818 3031.3964 3085.9244 3088.4564 3093.8196 3094.8878 3119.2077 3120.8850 3128.1742 3134.1670 3136.7130 3145.8035 3149.2528 3161.6001 3163.6588 3174.4453 3177.1577 3181.2763
redmass: 4.1027 4.6579 3.8422 3.8095 4.2114 3.5588 4.5082 4.5867 4.1475 3.2862 4.5259 5.0669 4.6731 4.2352 5.0692 2.6866 1.6127 1.4290 4.3162 6.9864 5.1872 4.0244 2.7148 3.4335 7.4958 5.5087 4.8256 2.8966 2.8726 4.3032 4.9381 4.4932 5.0892 4.1492 6.4633 6.4301 6.3865 6.8008 10.0200 6.7188 6.8496 2.0896 1.9168 5.2686 3.1914 4.5116 3.1576 1.7585 2.8720 2.7875 1.3944 1.8530 3.7694 1.3652 2.8041 1.2576 1.4034 1.4203 7.8452 1.3976 1.5410 3.1097 6.0861 4.7834 1.3162 1.3261 2.7367 2.6706 3.9909 2.4485 3.2269 1.6881 1.8986 2.1620 2.1533 5.4997 4.2945 1.6684 1.6832 1.0520 1.0549 1.1176 1.1285 6.6584 1.1175 1.1205 4.6392 1.6076 1.3377 3.6037 1.3179 1.3507 6.6042 9.8452 1.2315 1.2297 5.5035 2.2852 2.4243 1.8364 1.1007 1.0703 1.1144 1.6134 2.5324 1.0844 1.1237 2.3842 7.3087 5.9395 6.7388 6.1044 6.1432 10.4056 10.7469 1.0362 1.0361 1.0597 1.0593 1.0977 1.0972 1.1029 1.1029 1.1059 1.1061 1.0851 1.0854 1.0889 1.0900 1.0944 1.0948 1.0986 1.0962 1.0975 1.0987
irintensity: 1.5892 0.1776 0.5284 1.7855 1.4850 0.4459 0.7300 0.0106 0.5073 0.3901 0.2880 0.3444 0.0884 0.5890 2.8122 1.0276 0.1409 3.8169 0.1918 0.7041 1.3293 1.4750 18.9170 4.3500 8.2083 5.9329 4.3495 0.3168 0.2696 4.4708 3.5775 0.1366 3.0033 9.3424 9.7567 1.6790 0.5997 6.2097 6.3237 3.6838 0.7419 28.7926 52.2414 5.1049 15.0396 57.9592 5.3658 54.5803 36.8773 3.7405 9.9070 0.4378 1.3315 0.5325 0.2983 1.3541 5.7689 6.3923 30.0207 1.7319 12.5370 48.3145 0.1900 0.9501 0.3999 0.7471 20.3031 1.6422 253.8347 163.7726 80.8846 3.6246 42.0620 27.6412 32.6995 127.9516 91.2790 27.8400 20.3576 0.0762 0.0264 1.2327 2.2025 231.2224 3.0171 5.4162 116.0526 17.0648 1.2282 57.1794 5.2415 2.2123 5.7995 1.1435 27.5642 21.9020 82.2627 8.9949 0.5087 0.5174 3.7450 15.6267 25.5684 30.5155 55.3768 29.8622 49.8823 26.6791 21.3598 0.5293 0.7772 33.6354 4.4749 115.2352 282.4623 20.5014 21.9477 34.8076 32.3853 40.9492 41.8166 1.8042 1.1271 25.8530 29.1688 0.7943 0.1189 5.0815 12.2240 25.6500 30.4286 22.7240 7.2603 5.9871 4.1843
temp: 298.150 k
press: 1.00000 atm
elementType: 8 8 8 8 7 7 6 6 6 6 6 6 6 6 6 6 6 6 6 6 6 6 6 6 6 6 6 1 1 1 1 1 1 1 1 1 1 1 1 1 1 1 1 1 1 1 1
symmnumber: 1
zpe: 959595.7 jmol-1
zpe.correction: 0.365491 hartree
zpe.thermalcorrener: 0.390828 hartree
zpe.thermalcorrenthalpy: 0.391772 hartree
zpe.thermalcorrgfe: 0.306414 hartree
zpe.sumelectzpe: -1220.700363 hartree
zpe.sumelectthermal: -1220.675026 hartree
zpe.sumelectthermalent: -1220.674082 hartree
zpe.sumelectthermalfe: -1220.759440 hartree
dipole: 4.3203 -0.5583 -0.5113
dipole: 4.3861
quadrupole: -136.3854 -135.5055 -156.4900
quadrupole: 7.9192 -1.0387 -8.4453
quadrupole: 6.4083 7.2881 -13.6964 7.9192 -1.0387 -8.4453
hfenergy: -1221.0658541 hartree
pointgroup: C01 [X(C21H20N2O4)]
dipole: -1.6119919 0.5668006 -0.2409212 debye
polarizability: 320.5521574|-13.4588171|295.8497282|23.026789|37.3253147|173.6618716 unknown
InChI: InChI=1S/C21H20N2O4/c1-3-26-20(24)17-18(21(25)27-4-2)22-23(16-13-9-6-10-14-16)19(17)15-11-7-5-8-12-15/h5-14H,3-4H2,1-2H3
charge 0 multiplicity 1
47 atoms
O  0.114641 -2.941988 -1.152904
O  3.94993 0.586713 0.923767
O  1.43836 -3.022185 0.769436
O  3.718986 -1.268069 -0.48358
N  -0.044279 1.230042 0.089051
N  1.337558 1.317381 0.245411
C  -0.483679 -0.089852 -0.110476
C  0.685658 -0.880878 -0.090768
C  -1.914691 -0.474351 -0.13446
C  1.771548 0.028719 0.145168
C  -0.791919 2.461908 0.086349
C  0.800742 -2.360356 -0.081782
C  -2.444914 -1.257102 -1.193219
C  -2.775512 -0.064216 0.921027
C  -1.89701 2.639264 -0.778959
C  -0.362716 3.509845 0.934817
C  3.218782 -0.304086 0.145249
C  -3.811375 -1.613812 -1.199192
C  -4.138392 -0.425886 0.913321
C  -2.591729 3.867757 -0.768998
C  -1.061569 4.735052 0.92959
C  -4.66289 -1.199427 -0.149072
C  -2.181447 4.917668 0.084561
C  0.155518 -4.438247 -1.219658
C  5.433697 0.390439 0.922845
C  -0.928685 -5.056941 -0.33241
C  6.070828 1.101541 -0.274432
H  -1.78132 -1.584486 -1.998049
H  -2.372951 0.528199 1.749939
H  -2.204149 1.839094 -1.457427
H  0.514631 3.356322 1.568709
H  -4.210366 -2.212873 -2.025204
H  -4.788673 -0.107927 1.735376
H  -3.447283 4.005719 -1.43864
H  -0.730084 5.546744 1.585975
H  -5.722623 -1.477763 -0.155842
H  -2.72275 5.869801 0.085439
H  1.163811 -4.769988 -0.916635
H  -0.009005 -4.649598 -2.288444
H  5.645085 -0.693264 0.908716
H  5.748656 0.829417 1.882708
H  -1.925284 -4.658096 -0.589903
H  -0.727016 -4.852033 0.731994
H  -0.944609 -6.153548 -0.475741
H  5.795823 2.17013 -0.287905
H  5.749812 0.637734 -1.222084
H  7.172356 1.026482 -0.209065
